BDBM50139693 3-Benzyloxycarbonylamino-4-oxo-5-(3-phenyl-propane-1-sulfonylamino)-pentanoic acid::CHEMBL165763
SMILES: OC(=O)CC(NC(=O)OCc1ccccc1)C(=O)CNS(=O)(=O)CCCc1ccccc1
InChI Key: InChIKey=ALDJQKXTSWRTTG-UHFFFAOYSA-N
Data: 1 KI  1 IC50
Activity Spreadsheet -- Enzyme Inhibition Constant Data from BindingDB
Found 2 hits for monomerid = 50139693
Trg + Lig
Ki
nM
ΔG°
kcal/mole
IC50
nM
Kd
nM
EC50/IC50
nM
koff
s-1
kon
M-1s-1
pHTemp
°C
Caspase-1
(Homo sapiens (Human))
BDBM50139693
(3-Benzyloxycarbonylamino-4-oxo-5-(3-phenyl-propane...)
Show SMILES OC(=O)CC(NC(=O)OCc1ccccc1)C(=O)CNS(=O)(=O)CCCc1ccccc1
Show InChI InChI=1S/C22H26N2O7S/c25-20(15-23-32(29,30)13-7-12-17-8-3-1-4-9-17)19(14-21(26)27)24-22(28)31-16-18-10-5-2-6-11-18/h1-6,8-11,19,23H,7,12-16H2,(H,24,28)(H,26,27)
NCI pathway
Reactome pathway
3.45E+4n/an/an/an/an/an/an/an/a
Pfizer Global Research and Development
Curated by ChEMBL
Assay Description
Inhibitory activity against caspase-1
Bioorg Med Chem Lett 14: 809-12 (2004)
BindingDB Entry DOI: 10.7270/Q2FB52CR
Caspase-1
(Homo sapiens (Human))
BDBM50139693
(3-Benzyloxycarbonylamino-4-oxo-5-(3-phenyl-propane...)
Show SMILES OC(=O)CC(NC(=O)OCc1ccccc1)C(=O)CNS(=O)(=O)CCCc1ccccc1
Show InChI InChI=1S/C22H26N2O7S/c25-20(15-23-32(29,30)13-7-12-17-8-3-1-4-9-17)19(14-21(26)27)24-22(28)31-16-18-10-5-2-6-11-18/h1-6,8-11,19,23H,7,12-16H2,(H,24,28)(H,26,27)
NCI pathway
Reactome pathway
n/an/a 2.45E+5n/an/an/an/an/an/a
Pfizer Global Research and Development
Curated by ChEMBL
Assay Description
Inhibitory activity against caspase-1
Bioorg Med Chem Lett 14: 809-12 (2004)
BindingDB Entry DOI: 10.7270/Q2FB52CR