BDBM50139697 3-Benzyloxycarbonylamino-5-(2-cyclohexyl-ethanesulfonylamino)-4-oxo-pentanoic acid::CHEMBL354101
SMILES: OC(=O)CC(NC(=O)OCc1ccccc1)C(=O)CNS(=O)(=O)CCC1CCCCC1
InChI Key: InChIKey=HGAUHJYHPRSZGO-UHFFFAOYSA-N
Data: 1 KI  1 IC50
Activity Spreadsheet -- Enzyme Inhibition Constant Data from BindingDB
Found 2 hits for monomerid = 50139697
Trg + Lig
Ki
nM
ΔG°
kcal/mole
IC50
nM
Kd
nM
EC50/IC50
nM
koff
s-1
kon
M-1s-1
pHTemp
°C
Caspase-1
(Homo sapiens (Human))
BDBM50139697
(3-Benzyloxycarbonylamino-5-(2-cyclohexyl-ethanesul...)
Show SMILES OC(=O)CC(NC(=O)OCc1ccccc1)C(=O)CNS(=O)(=O)CCC1CCCCC1
Show InChI InChI=1S/C21H30N2O7S/c24-19(14-22-31(28,29)12-11-16-7-3-1-4-8-16)18(13-20(25)26)23-21(27)30-15-17-9-5-2-6-10-17/h2,5-6,9-10,16,18,22H,1,3-4,7-8,11-15H2,(H,23,27)(H,25,26)
NCI pathway
Reactome pathway
3.30E+4n/an/an/an/an/an/an/an/a
Pfizer Global Research and Development
Curated by ChEMBL
Assay Description
Inhibitory activity against caspase-1
Bioorg Med Chem Lett 14: 809-12 (2004)
BindingDB Entry DOI: 10.7270/Q2FB52CR
Caspase-1
(Homo sapiens (Human))
BDBM50139697
(3-Benzyloxycarbonylamino-5-(2-cyclohexyl-ethanesul...)
Show SMILES OC(=O)CC(NC(=O)OCc1ccccc1)C(=O)CNS(=O)(=O)CCC1CCCCC1
Show InChI InChI=1S/C21H30N2O7S/c24-19(14-22-31(28,29)12-11-16-7-3-1-4-8-16)18(13-20(25)26)23-21(27)30-15-17-9-5-2-6-10-17/h2,5-6,9-10,16,18,22H,1,3-4,7-8,11-15H2,(H,23,27)(H,25,26)
NCI pathway
Reactome pathway
n/an/a 1.36E+5n/an/an/an/an/an/a
Pfizer Global Research and Development
Curated by ChEMBL
Assay Description
Inhibitory activity against caspase-1
Bioorg Med Chem Lett 14: 809-12 (2004)
BindingDB Entry DOI: 10.7270/Q2FB52CR