BDBM50143559 (E)-N-[1-((S)-4-Ethyl-3,4-dihydro-2H-benzo[1,4]oxazin-6-yl)-ethyl]-3-(2-fluoro-phenyl)-acrylamide::CHEMBL174891
SMILES: CCN1CCOc2ccc(cc12)[C@H](C)NC(=O)\C=C\c1ccccc1F
InChI Key: InChIKey=WPIUCHABIRMTJY-GDXASINISA-N
Data: 1 EC50
Activity Spreadsheet -- Enzyme Inhibition Constant Data from BindingDB
Found 1 hit for monomerid = 50143559
Trg + Lig
Ki
nM
ΔG°
kcal/mole
IC50
nM
Kd
nM
EC50/IC50
nM
koff
s-1
kon
M-1s-1
pHTemp
°C
Voltage-gated potassium channel subunit Kv7.2
(Mus musculus)
BDBM50143559
((E)-N-[1-((S)-4-Ethyl-3,4-dihydro-2H-benzo[1,4]oxa...)
Show SMILES CCN1CCOc2ccc(cc12)[C@H](C)NC(=O)\C=C\c1ccccc1F
Show InChI InChI=1S/C21H23FN2O2/c1-3-24-12-13-26-20-10-8-17(14-19(20)24)15(2)23-21(25)11-9-16-6-4-5-7-18(16)22/h4-11,14-15H,3,12-13H2,1-2H3,(H,23,25)/b11-9+/t15-/m0/s1
Reactome pathway
n/an/an/an/a 200n/an/an/an/a
Bristol-Myers Squibb Pharmaceutical Research Institute
Curated by ChEMBL
Assay Description
Whole-cell patch-clamp on recombinant mouse KCNQ2 channels expressed in HEK 293 cells at -40 mV
Bioorg Med Chem Lett 14: 1991-5 (2004)
Article DOI: 10.1016/j.bmcl.2004.01.069
BindingDB Entry DOI: 10.7270/Q2MG7NZ3