BDBM50147696 CHEMBL3763438
SMILES: Cc1nc2sccn2c1C(=O)NNC(=O)c1ccc(Oc2ccccc2)cc1
InChI Key: InChIKey=YTOJKVATVDCHJT-UHFFFAOYSA-N
Data: 1 IC50
Activity Spreadsheet -- Enzyme Inhibition Constant Data from BindingDB
Found 1 hit for monomerid = 50147696
Trg + Lig
Ki
nM
ΔG°
kcal/mole
IC50
nM
Kd
nM
EC50/IC50
nM
koff
s-1
kon
M-1s-1
pHTemp
°C
Pantothenate synthetase
(Mycobacterium tuberculosis (strain ATCC 25618 / H3...)
BDBM50147696
(CHEMBL3763438)
Show SMILES Cc1nc2sccn2c1C(=O)NNC(=O)c1ccc(Oc2ccccc2)cc1
Show InChI InChI=1S/C20H16N4O3S/c1-13-17(24-11-12-28-20(24)21-13)19(26)23-22-18(25)14-7-9-16(10-8-14)27-15-5-3-2-4-6-15/h2-12H,1H3,(H,22,25)(H,23,26)
n/an/a 1.23E+3n/an/an/an/an/an/a
Birla Institute of Technology& Science-Pilani
Curated by ChEMBL
Assay Description
Inhibition of Mycobacterium tuberculosis pantothenate synthetase using pantoic acid as substrate and beta-alanine as reactant assessed as NAD+ format...
Bioorg Med Chem 24: 1298-307 (2016)
BindingDB Entry DOI: 10.7270/Q2C82C5B