BDBM50150945 CHEBI:81390::IMMEPIP::Immepip
SMILES: C(C1CCNCC1)c1c[nH]cn1
InChI Key: InChIKey=MCNGUYXRBCIGOV-UHFFFAOYSA-N
Data: 8 KI  5 EC50
PDB links: 1 PDB ID matches this monomer.
Activity Spreadsheet -- Enzyme Inhibition Constant Data from BindingDB
Found 13 hits for monomerid = 50150945
Trg + Lig
Ki
nM
ΔG°
kcal/mole
IC50
nM
Kd
nM
EC50/IC50
nM
koff
s-1
kon
M-1s-1
pHTemp
°C
Histamine H3 receptor
(Homo sapiens (Human))
BDBM50150945
(CHEBI:81390 | IMMEPIP | Immepip)
Show SMILES C(C1CCNCC1)c1c[nH]cn1
Show InChI InChI=1S/C9H15N3/c1-3-10-4-2-8(1)5-9-6-11-7-12-9/h6-8,10H,1-5H2,(H,11,12)
Reactome pathway
0.479n/an/an/an/an/an/an/an/a
University of Minnesota
Curated by ChEMBL
Assay Description
Inhibition of KDM5B (unknown origin) using biotin-H3K4me3 as substrate preincubated for 15 mins followed by substrate addition measured after 20 mins...
J Med Chem 59: 810-40 (2016)
BindingDB Entry DOI: 10.7270/Q2XS5X8K
Histamine H3 receptor
(Homo sapiens (Human))
BDBM50150945
(CHEBI:81390 | IMMEPIP | Immepip)
Show SMILES C(C1CCNCC1)c1c[nH]cn1
Show InChI InChI=1S/C9H15N3/c1-3-10-4-2-8(1)5-9-6-11-7-12-9/h6-8,10H,1-5H2,(H,11,12)
Reactome pathway
0.479n/an/an/an/an/an/an/an/a
Vrije Universiteit
Curated by ChEMBL
Assay Description
Inhibitory activity measured by [3H]- N alpha- methyl-histamine binding to membranes of SK-N-MC cells expressing the human Histamine H3 receptor
J Med Chem 46: 5445-57 (2003)
Article DOI: 10.1021/jm030905y
BindingDB Entry DOI: 10.7270/Q2FN18X0
Histamine H3 receptor
(Homo sapiens (Human))
BDBM50150945
(CHEBI:81390 | IMMEPIP | Immepip)
Show SMILES C(C1CCNCC1)c1c[nH]cn1
Show InChI InChI=1S/C9H15N3/c1-3-10-4-2-8(1)5-9-6-11-7-12-9/h6-8,10H,1-5H2,(H,11,12)
Reactome pathway
0.501n/an/an/an/an/an/an/an/a
University of Regensburg
Curated by ChEMBL
Assay Description
Displacement of [3H]Nalpha-methylhistamine from human histamine H3 receptor expressed in human SK-N-MC cells
Bioorg Med Chem Lett 20: 7191-9 (2010)
Article DOI: 10.1016/j.bmcl.2010.10.041
BindingDB Entry DOI: 10.7270/Q2Q81GX5
Histamine H3 receptor
(Homo sapiens (Human))
BDBM50150945
(CHEBI:81390 | IMMEPIP | Immepip)
Show SMILES C(C1CCNCC1)c1c[nH]cn1
Show InChI InChI=1S/C9H15N3/c1-3-10-4-2-8(1)5-9-6-11-7-12-9/h6-8,10H,1-5H2,(H,11,12)
Reactome pathway
0.501n/an/an/an/an/an/an/an/a
Vrije Universiteit Amsterdam
Curated by ChEMBL
Assay Description
Displacement of [3H]N-R-methylhistamine binding to SK-N-MC cell membranes expressing human H3 receptor
J Med Chem 48: 2100-7 (2005)
Article DOI: 10.1021/jm049475h
BindingDB Entry DOI: 10.7270/Q28K7CVC
Histamine receptor (H3 and H4)
(Homo sapiens (Human))
BDBM50150945
(CHEBI:81390 | IMMEPIP | Immepip)
Show SMILES C(C1CCNCC1)c1c[nH]cn1
Show InChI InChI=1S/C9H15N3/c1-3-10-4-2-8(1)5-9-6-11-7-12-9/h6-8,10H,1-5H2,(H,11,12)
Reactome pathway
20n/an/an/an/an/an/an/an/a
University of Regensburg
Curated by ChEMBL
Assay Description
Displacement of [3H]-histamine from human histamine H4 receptor expressed in Sf9 cells coexpressing RGS19, Galphai2, Gbeta1gamma2
Bioorg Med Chem Lett 20: 7191-9 (2010)
Article DOI: 10.1016/j.bmcl.2010.10.041
BindingDB Entry DOI: 10.7270/Q2Q81GX5
Histamine receptor (H3 and H4)
(Homo sapiens (Human))
BDBM50150945
(CHEBI:81390 | IMMEPIP | Immepip)
Show SMILES C(C1CCNCC1)c1c[nH]cn1
Show InChI InChI=1S/C9H15N3/c1-3-10-4-2-8(1)5-9-6-11-7-12-9/h6-8,10H,1-5H2,(H,11,12)
Reactome pathway
20n/an/an/an/an/an/an/an/a
Vrije Universiteit Amsterdam
Curated by ChEMBL
Assay Description
Displacement of [3H]histamine binding to SK-N-MC cell membranes expressing human histamine H4 receptor
J Med Chem 48: 2100-7 (2005)
Article DOI: 10.1021/jm049475h
BindingDB Entry DOI: 10.7270/Q28K7CVC
Histamine H2 receptor
(Homo sapiens (Human))
BDBM50150945
(CHEBI:81390 | IMMEPIP | Immepip)
Show SMILES C(C1CCNCC1)c1c[nH]cn1
Show InChI InChI=1S/C9H15N3/c1-3-10-4-2-8(1)5-9-6-11-7-12-9/h6-8,10H,1-5H2,(H,11,12)
Reactome pathway
<1.00E+4n/an/an/an/an/an/an/an/a
Vrije Universiteit Amsterdam
Curated by ChEMBL
Assay Description
Displacement of [125I]aminopotentidine binding to CHO cell membranes expressing human histamine H2 receptor
J Med Chem 48: 2100-7 (2005)
Article DOI: 10.1021/jm049475h
BindingDB Entry DOI: 10.7270/Q28K7CVC
Histamine receptor (H3 and H4)
(Homo sapiens (Human))
BDBM50150945
(CHEBI:81390 | IMMEPIP | Immepip)
Show SMILES C(C1CCNCC1)c1c[nH]cn1
Show InChI InChI=1S/C9H15N3/c1-3-10-4-2-8(1)5-9-6-11-7-12-9/h6-8,10H,1-5H2,(H,11,12)
Reactome pathway
1.00E+14n/an/an/an/an/an/an/an/a
Vrije Universiteit
Curated by ChEMBL
Assay Description
Inhibitory activity measured by [3H]- N alpha- methyl-histamine binding to membranes of SK-N-MC cells expressing the human Histamine H4 receptor
J Med Chem 46: 5445-57 (2003)
Article DOI: 10.1021/jm030905y
BindingDB Entry DOI: 10.7270/Q2FN18X0
Histamine H3 receptor
(Homo sapiens (Human))
BDBM50150945
(CHEBI:81390 | IMMEPIP | Immepip)
Show SMILES C(C1CCNCC1)c1c[nH]cn1
Show InChI InChI=1S/C9H15N3/c1-3-10-4-2-8(1)5-9-6-11-7-12-9/h6-8,10H,1-5H2,(H,11,12)
Reactome pathway
n/an/an/an/a 0.126n/an/an/an/a
Vrije Universiteit Amsterdam
Curated by ChEMBL
Assay Description
Inhibition of cAMP-stimulated beta-galactosidase transcription in SK-N-MC cells expressing human H3 receptor
J Med Chem 48: 2100-7 (2005)
Article DOI: 10.1021/jm049475h
BindingDB Entry DOI: 10.7270/Q28K7CVC
Histamine receptor (H3 and H4)
(Homo sapiens (Human))
BDBM50150945
(CHEBI:81390 | IMMEPIP | Immepip)
Show SMILES C(C1CCNCC1)c1c[nH]cn1
Show InChI InChI=1S/C9H15N3/c1-3-10-4-2-8(1)5-9-6-11-7-12-9/h6-8,10H,1-5H2,(H,11,12)
Reactome pathway
n/an/an/an/a 56n/an/an/an/a
Vrije Universiteit
Curated by ChEMBL
Assay Description
Inhibitory activity determined by the inhibition of cAMP- stimulated beta-galactosidase transcription in SK-N-MC cells expressing the human Histamine...
J Med Chem 46: 5445-57 (2003)
Article DOI: 10.1021/jm030905y
BindingDB Entry DOI: 10.7270/Q2FN18X0
Histamine H3 receptor
(Homo sapiens (Human))
BDBM50150945
(CHEBI:81390 | IMMEPIP | Immepip)
Show SMILES C(C1CCNCC1)c1c[nH]cn1
Show InChI InChI=1S/C9H15N3/c1-3-10-4-2-8(1)5-9-6-11-7-12-9/h6-8,10H,1-5H2,(H,11,12)
Reactome pathway
n/an/an/an/a 0.132n/an/an/an/a
Vrije Universiteit
Curated by ChEMBL
Assay Description
Inhibitory activity determined by the inhibition of cAMP- stimulated beta-galactosidase transcription in SK-N-MC cells expressing the human Histamine...
J Med Chem 46: 5445-57 (2003)
Article DOI: 10.1021/jm030905y
BindingDB Entry DOI: 10.7270/Q2FN18X0
Histamine receptor (H3 and H4)
(Homo sapiens (Human))
BDBM50150945
(CHEBI:81390 | IMMEPIP | Immepip)
Show SMILES C(C1CCNCC1)c1c[nH]cn1
Show InChI InChI=1S/C9H15N3/c1-3-10-4-2-8(1)5-9-6-11-7-12-9/h6-8,10H,1-5H2,(H,11,12)
Reactome pathway
n/an/an/an/a 16n/an/an/an/a
University of Regensburg
Curated by ChEMBL
Assay Description
Agonist activity at human histamine H4 receptor expressed in human SK-N-MC cells by CRE-beta galactosidase reporter gene assay
Bioorg Med Chem Lett 20: 7191-9 (2010)
Article DOI: 10.1016/j.bmcl.2010.10.041
BindingDB Entry DOI: 10.7270/Q2Q81GX5
Histamine H3 receptor
(Homo sapiens (Human))
BDBM50150945
(CHEBI:81390 | IMMEPIP | Immepip)
Show SMILES C(C1CCNCC1)c1c[nH]cn1
Show InChI InChI=1S/C9H15N3/c1-3-10-4-2-8(1)5-9-6-11-7-12-9/h6-8,10H,1-5H2,(H,11,12)
Reactome pathway
n/an/an/an/a 0.0398n/an/an/an/a
University of Regensburg
Curated by ChEMBL
Assay Description
Agonist activity at human histamine H3 receptor expressed in human SK-N-MC cells by CRE-beta galactosidase reporter gene assay
Bioorg Med Chem Lett 20: 7191-9 (2010)
Article DOI: 10.1016/j.bmcl.2010.10.041
BindingDB Entry DOI: 10.7270/Q2Q81GX5