BDBM50151374 CHEMBL3774877
SMILES: COc1ccc(cc1OCC(=O)NO)N(C)c1nc(C)nc2ccccc12
InChI Key: InChIKey=HJMBIWAIDCSLTD-UHFFFAOYSA-N
Data: 3 IC50
Activity Spreadsheet -- Enzyme Inhibition Constant Data from BindingDB
Found 3 hits for monomerid = 50151374
Trg + Lig
Ki
nM
ΔG°
kcal/mole
IC50
nM
Kd
nM
EC50/IC50
nM
koff
s-1
kon
M-1s-1
pHTemp
°C
Histone deacetylase 1
(Homo sapiens (Human))
BDBM50151374
(CHEMBL3774877)
Show SMILES COc1ccc(cc1OCC(=O)NO)N(C)c1nc(C)nc2ccccc12
Show InChI InChI=1S/C19H20N4O4/c1-12-20-15-7-5-4-6-14(15)19(21-12)23(2)13-8-9-16(26-3)17(10-13)27-11-18(24)22-25/h4-10,25H,11H2,1-3H3,(H,22,24)
NCI pathway
Reactome pathway
n/an/a>1.00E+3n/an/an/an/an/an/a
Sichuan University
Curated by ChEMBL
Assay Description
Inhibition of KDM5B (unknown origin) using biotin-H3K4me3 as substrate preincubated for 15 mins followed by substrate addition measured after 20 mins...
J Med Chem 59: 1455-70 (2016)
BindingDB Entry DOI: 10.7270/Q2T155H3
Histone deacetylase 8
(Homo sapiens (Human))
BDBM50151374
(CHEMBL3774877)
Show SMILES COc1ccc(cc1OCC(=O)NO)N(C)c1nc(C)nc2ccccc12
Show InChI InChI=1S/C19H20N4O4/c1-12-20-15-7-5-4-6-14(15)19(21-12)23(2)13-8-9-16(26-3)17(10-13)27-11-18(24)22-25/h4-10,25H,11H2,1-3H3,(H,22,24)
NCI pathway
Reactome pathway
n/an/a>1.00E+3n/an/an/an/an/an/a
Sichuan University
Curated by ChEMBL
Assay Description
Inhibition of KDM5C (unknown origin) using biotin-H3K4me3 as substrate preincubated for 15 mins followed by substrate addition measured after 20 mins...
J Med Chem 59: 1455-70 (2016)
BindingDB Entry DOI: 10.7270/Q2T155H3
Cereblon/Histone deacetylase 6
(Homo sapiens (Human))
BDBM50151374
(CHEMBL3774877)
Show SMILES COc1ccc(cc1OCC(=O)NO)N(C)c1nc(C)nc2ccccc12
Show InChI InChI=1S/C19H20N4O4/c1-12-20-15-7-5-4-6-14(15)19(21-12)23(2)13-8-9-16(26-3)17(10-13)27-11-18(24)22-25/h4-10,25H,11H2,1-3H3,(H,22,24)
NCI pathway
Reactome pathway
n/an/a>1.00E+3n/an/an/an/an/an/a
Sichuan University
Curated by ChEMBL
Assay Description
Inhibition of KDM5C (unknown origin) using biotin-H3K4me3 as substrate preincubated for 15 mins followed by substrate addition measured after 20 mins...
J Med Chem 59: 1455-70 (2016)
BindingDB Entry DOI: 10.7270/Q2T155H3