BDBM50154965 CHEMBL3775423
SMILES: Cn1cc(cn1)-c1ccc(Cc2n[nH]c3ccc(cc23)C(=O)N2CC(O)C2)cc1
InChI Key: InChIKey=OMIZKYBIVWGYBC-UHFFFAOYSA-N
Data: 2 IC50
Activity Spreadsheet -- Enzyme Inhibition Constant Data from BindingDB
Found 2 hits for monomerid = 50154965
Trg + Lig
Ki
nM
ΔG°
kcal/mole
IC50
nM
Kd
nM
EC50/IC50
nM
koff
s-1
kon
M-1s-1
pHTemp
°C
Cyclin-dependent kinase 8
(Homo sapiens (Human))
BDBM50154965
(CHEMBL3775423)
Show SMILES Cn1cc(cn1)-c1ccc(Cc2n[nH]c3ccc(cc23)C(=O)N2CC(O)C2)cc1
Show InChI InChI=1S/C22H21N5O2/c1-26-11-17(10-23-26)15-4-2-14(3-5-15)8-21-19-9-16(6-7-20(19)24-25-21)22(29)27-12-18(28)13-27/h2-7,9-11,18,28H,8,12-13H2,1H3,(H,24,25)
Reactome pathway
n/an/a 94n/an/an/an/an/an/a
Merck KGaA
Curated by ChEMBL
Assay Description
Inhibition of CDK8 (unknown origin) expressed in 7dF3 clone of human HEK293 cells preincubated for 2 hrs followed by addition of beta-estradiol by lu...
Bioorg Med Chem Lett 26: 1443-51 (2016)
BindingDB Entry DOI: 10.7270/Q2NZ89G6
Cyclin-C
(Homo sapiens (Human))
BDBM50154965
(CHEMBL3775423)
Show SMILES Cn1cc(cn1)-c1ccc(Cc2n[nH]c3ccc(cc23)C(=O)N2CC(O)C2)cc1
Show InChI InChI=1S/C22H21N5O2/c1-26-11-17(10-23-26)15-4-2-14(3-5-15)8-21-19-9-16(6-7-20(19)24-25-21)22(29)27-12-18(28)13-27/h2-7,9-11,18,28H,8,12-13H2,1H3,(H,24,25)
n/an/a 4n/an/an/an/an/an/a
Merck KGaA
Curated by ChEMBL
Assay Description
Displacement of dye-labeled ATP competitive probe from recombinant human CDK8/Cyclin C incubated for 20 mins by Alexa647 probe-based FRET assay
Bioorg Med Chem Lett 26: 1443-51 (2016)
BindingDB Entry DOI: 10.7270/Q2NZ89G6