BDBM50159114 CHEMBL179234::Cyclopropyl-[2-(4-cyclopropyl-piperazin-1-yl)-quinolin-6-yl]-methanone
SMILES: O=C(C1CC1)c1ccc2nc(ccc2c1)N1CCN(CC1)C1CC1
InChI Key: InChIKey=REZSROOERNUDJU-UHFFFAOYSA-N
Data: 1 KI  4 IC50
Activity Spreadsheet -- Enzyme Inhibition Constant Data from BindingDB
Found 5 hits for monomerid = 50159114
Trg + Lig
Ki
nM
ΔG°
kcal/mole
IC50
nM
Kd
nM
EC50/IC50
nM
koff
s-1
kon
M-1s-1
pHTemp
°C
Histamine H3 receptor
(Homo sapiens (Human))
BDBM50159114
(CHEMBL179234 | Cyclopropyl-[2-(4-cyclopropyl-piper...)
Show SMILES O=C(C1CC1)c1ccc2nc(ccc2c1)N1CCN(CC1)C1CC1
Show InChI InChI=1S/C20H23N3O/c24-20(14-1-2-14)16-3-7-18-15(13-16)4-8-19(21-18)23-11-9-22(10-12-23)17-5-6-17/h3-4,7-8,13-14,17H,1-2,5-6,9-12H2
Reactome pathway
1.80n/an/an/an/an/an/an/an/a
Novo Nordisk A/S
Curated by ChEMBL
Assay Description
Antagonist potency against human H3 receptor in GTPgamma[S]-Assay
J Med Chem 48: 306-11 (2005)
Article DOI: 10.1021/jm040873u
BindingDB Entry DOI: 10.7270/Q2N0161T
5-hydroxytryptamine receptor 2A
(Homo sapiens (Human))
BDBM50159114
(CHEMBL179234 | Cyclopropyl-[2-(4-cyclopropyl-piper...)
Show SMILES O=C(C1CC1)c1ccc2nc(ccc2c1)N1CCN(CC1)C1CC1
Show InChI InChI=1S/C20H23N3O/c24-20(14-1-2-14)16-3-7-18-15(13-16)4-8-19(21-18)23-11-9-22(10-12-23)17-5-6-17/h3-4,7-8,13-14,17H,1-2,5-6,9-12H2
Reactome pathway
n/an/a>1.00E+4n/an/an/an/an/an/a
Novo Nordisk A/S
Curated by ChEMBL
Assay Description
Inhibiton of [3H]-ketanserin binding to human 5-HT2 receptor
J Med Chem 48: 306-11 (2005)
Article DOI: 10.1021/jm040873u
BindingDB Entry DOI: 10.7270/Q2N0161T
Histamine H4 receptor
(Homo sapiens (Human))
BDBM50159114
(CHEMBL179234 | Cyclopropyl-[2-(4-cyclopropyl-piper...)
Show SMILES O=C(C1CC1)c1ccc2nc(ccc2c1)N1CCN(CC1)C1CC1
Show InChI InChI=1S/C20H23N3O/c24-20(14-1-2-14)16-3-7-18-15(13-16)4-8-19(21-18)23-11-9-22(10-12-23)17-5-6-17/h3-4,7-8,13-14,17H,1-2,5-6,9-12H2
Reactome pathway
n/an/a>1.00E+4n/an/an/an/an/an/a
Novo Nordisk A/S
Curated by ChEMBL
Assay Description
Inhibiton of [3H]-histamine binding to human H4 histamine receptor
J Med Chem 48: 306-11 (2005)
Article DOI: 10.1021/jm040873u
BindingDB Entry DOI: 10.7270/Q2N0161T
Histamine H1 receptor
(Homo sapiens (Human))
BDBM50159114
(CHEMBL179234 | Cyclopropyl-[2-(4-cyclopropyl-piper...)
Show SMILES O=C(C1CC1)c1ccc2nc(ccc2c1)N1CCN(CC1)C1CC1
Show InChI InChI=1S/C20H23N3O/c24-20(14-1-2-14)16-3-7-18-15(13-16)4-8-19(21-18)23-11-9-22(10-12-23)17-5-6-17/h3-4,7-8,13-14,17H,1-2,5-6,9-12H2
Reactome pathway
n/an/a>1.00E+4n/an/an/an/an/an/a
Novo Nordisk A/S
Curated by ChEMBL
Assay Description
Inhibition of [3H]-pyrilamine binding to human H1 histamine receptor
J Med Chem 48: 306-11 (2005)
Article DOI: 10.1021/jm040873u
BindingDB Entry DOI: 10.7270/Q2N0161T
Histamine H2 Receptor
(Homo sapiens (Human))
BDBM50159114
(CHEMBL179234 | Cyclopropyl-[2-(4-cyclopropyl-piper...)
Show SMILES O=C(C1CC1)c1ccc2nc(ccc2c1)N1CCN(CC1)C1CC1
Show InChI InChI=1S/C20H23N3O/c24-20(14-1-2-14)16-3-7-18-15(13-16)4-8-19(21-18)23-11-9-22(10-12-23)17-5-6-17/h3-4,7-8,13-14,17H,1-2,5-6,9-12H2
Reactome pathway
n/an/a>1.00E+4n/an/an/an/an/an/a
Novo Nordisk A/S
Curated by ChEMBL
Assay Description
Inhibition of [125I]-aminopotentidine binding to human H2 histamine receptor
J Med Chem 48: 306-11 (2005)
Article DOI: 10.1021/jm040873u
BindingDB Entry DOI: 10.7270/Q2N0161T