BDBM50168998 (2R,3R,4S)-2-((R)-Indan-1-ylaminomethyl)-pyrrolidine-3,4-diol::CHEMBL190634
SMILES: O[C@H]1CN[C@H](CNC2CCc3ccccc23)[C@H]1O
InChI Key: InChIKey=WHMUBFWFVIHUPX-WTUNAVPPSA-N
Data: 1 KI  1 IC50
Activity Spreadsheet -- Enzyme Inhibition Constant Data from BindingDB
Found 2 hits for monomerid = 50168998
Trg + Lig
Ki
nM
ΔG°
kcal/mole
IC50
nM
Kd
nM
EC50/IC50
nM
koff
s-1
kon
M-1s-1
pHTemp
°C
Alpha-mannosidase
(Glycine max)
BDBM50168998
((2R,3R,4S)-2-((R)-Indan-1-ylaminomethyl)-pyrrolidi...)
Show SMILES O[C@H]1CN[C@H](CNC2CCc3ccccc23)[C@H]1O
Show InChI InChI=1S/C14H20N2O2/c17-13-8-16-12(14(13)18)7-15-11-6-5-9-3-1-2-4-10(9)11/h1-4,11-18H,5-8H2/t11?,12-,13+,14-/m1/s1
2.30E+3n/an/an/an/an/an/an/an/a
Institute of Chemical Sciences and Engineering
Curated by ChEMBL
Assay Description
Binding affinity towards alpha-Mannosidase isolated from Jack bean
J Med Chem 48: 4237-46 (2005)
Article DOI: 10.1021/jm0409019
BindingDB Entry DOI: 10.7270/Q24J0DNV
Alpha-mannosidase
(Glycine max)
BDBM50168998
((2R,3R,4S)-2-((R)-Indan-1-ylaminomethyl)-pyrrolidi...)
Show SMILES O[C@H]1CN[C@H](CNC2CCc3ccccc23)[C@H]1O
Show InChI InChI=1S/C14H20N2O2/c17-13-8-16-12(14(13)18)7-15-11-6-5-9-3-1-2-4-10(9)11/h1-4,11-18H,5-8H2/t11?,12-,13+,14-/m1/s1
n/an/a 1.70E+4n/an/an/an/an/an/a
Institute of Chemical Sciences and Engineering
Curated by ChEMBL
Assay Description
Concentration of compound inhibiting alpha-Mannosidase isolated from Jack bean
J Med Chem 48: 4237-46 (2005)
Article DOI: 10.1021/jm0409019
BindingDB Entry DOI: 10.7270/Q24J0DNV