BDBM50169071 CHEMBL3806024
SMILES: CNC(=O)c1cc2c(Oc3ccc(I)cc3)cncc2s1
InChI Key: InChIKey=QHMOZKVAGIEXJR-UHFFFAOYSA-N
Data: 1 IC50
PDB links: 1 PDB ID matches this monomer.
Activity Spreadsheet -- Enzyme Inhibition Constant Data from BindingDB
Found 1 hit for monomerid = 50169071
Trg + Lig
Ki
nM
ΔG°
kcal/mole
IC50
nM
Kd
nM
EC50/IC50
nM
koff
s-1
kon
M-1s-1
pHTemp
°C
Cyclin-C
(Homo sapiens (Human))
BDBM50169071
(CHEMBL3806024)
Show SMILES CNC(=O)c1cc2c(Oc3ccc(I)cc3)cncc2s1
Show InChI InChI=1S/C15H11IN2O2S/c1-17-15(19)13-6-11-12(7-18-8-14(11)21-13)20-10-4-2-9(16)3-5-10/h2-8H,1H3,(H,17,19)
n/an/a 5.30n/an/an/an/an/an/a
Genentech, Inc
Curated by ChEMBL
Assay Description
Inhibition of full length human recombinant His-tagged CDK8/Cyclin C expressed in baculovirus expression system by fluorescence polarization assay
ACS Med Chem Lett 7: 223-8 (2016)
BindingDB Entry DOI: 10.7270/Q29G5PPC
3D
3D Structure (crystal)