BDBM50171338 5-[3-(3,5-Bis-trifluoromethyl-phenyl)-ureido]-2-dimethylamino-N-(3-methoxy-propyl)-benzamide::CHEMBL363539
SMILES: COCCCNC(=O)c1cc(NC(=O)Nc2cc(cc(c2)C(F)(F)F)C(F)(F)F)ccc1N(C)C
InChI Key: InChIKey=TTXMIASHCRWOTD-UHFFFAOYSA-N
Data: 1 KI  1 IC50  1 EC50
Activity Spreadsheet -- Enzyme Inhibition Constant Data from BindingDB
Found 3 hits for monomerid = 50171338
Trg + Lig
Ki
nM
ΔG°
kcal/mole
IC50
nM
Kd
nM
EC50/IC50
nM
koff
s-1
kon
M-1s-1
pHTemp
°C
Beta-secretase 1
(Homo sapiens (Human))
BDBM50171338
(5-[3-(3,5-Bis-trifluoromethyl-phenyl)-ureido]-2-di...)
Show SMILES COCCCNC(=O)c1cc(NC(=O)Nc2cc(cc(c2)C(F)(F)F)C(F)(F)F)ccc1N(C)C
Show InChI InChI=1S/C22H24F6N4O3/c1-32(2)18-6-5-15(12-17(18)19(33)29-7-4-8-35-3)30-20(34)31-16-10-13(21(23,24)25)9-14(11-16)22(26,27)28/h5-6,9-12H,4,7-8H2,1-3H3,(H,29,33)(H2,30,31,34)
9.40E+3n/an/an/an/an/an/an/an/a
University of Zürich
Curated by ChEMBL
Assay Description
Predicted binding affinity for beta secretase by linear interaction energy continuum electrostatics
J Med Chem 48: 5108-11 (2005)
Article DOI: 10.1021/jm050499d
BindingDB Entry DOI: 10.7270/Q228074P
Beta-secretase (BACE)
(Homo sapiens (Human))
BDBM50171338
(5-[3-(3,5-Bis-trifluoromethyl-phenyl)-ureido]-2-di...)
Show SMILES COCCCNC(=O)c1cc(NC(=O)Nc2cc(cc(c2)C(F)(F)F)C(F)(F)F)ccc1N(C)C
Show InChI InChI=1S/C22H24F6N4O3/c1-32(2)18-6-5-15(12-17(18)19(33)29-7-4-8-35-3)30-20(34)31-16-10-13(21(23,24)25)9-14(11-16)22(26,27)28/h5-6,9-12H,4,7-8H2,1-3H3,(H,29,33)(H2,30,31,34)
NCI pathway
Reactome pathway
n/an/an/an/a 2.70E+4n/an/an/an/a
University of Zürich
Curated by ChEMBL
Assay Description
Beta-secretase inhibitory activity as inhibition of secreted alkaline phosphatase in HEK293 cells expressing SEAP-APP fusion protein
J Med Chem 48: 5108-11 (2005)
Article DOI: 10.1021/jm050499d
BindingDB Entry DOI: 10.7270/Q228074P
Beta-secretase 1
(Homo sapiens (Human))
BDBM50171338
(5-[3-(3,5-Bis-trifluoromethyl-phenyl)-ureido]-2-di...)
Show SMILES COCCCNC(=O)c1cc(NC(=O)Nc2cc(cc(c2)C(F)(F)F)C(F)(F)F)ccc1N(C)C
Show InChI InChI=1S/C22H24F6N4O3/c1-32(2)18-6-5-15(12-17(18)19(33)29-7-4-8-35-3)30-20(34)31-16-10-13(21(23,24)25)9-14(11-16)22(26,27)28/h5-6,9-12H,4,7-8H2,1-3H3,(H,29,33)(H2,30,31,34)
n/an/a 2.84E+5n/an/an/an/an/an/a
University of Zürich
Curated by ChEMBL
Assay Description
Inhibitory concentration against beta-site APP cleaving enzyme (BACE-1) by fluorescence resonance energy transfer assay
J Med Chem 48: 5108-11 (2005)
Article DOI: 10.1021/jm050499d
BindingDB Entry DOI: 10.7270/Q228074P