BDBM50172063 CHEMBL3805849
SMILES: Clc1ccc(cc1Cl)C1CC(=NN1c1ccccc1)c1ccc2OCCOc2c1
InChI Key: InChIKey=ZFSSLVSOUXEYKV-UHFFFAOYSA-N
Data: 3 IC50
Activity Spreadsheet -- Enzyme Inhibition Constant Data from BindingDB
Found 3 hits for monomerid = 50172063
Trg + Lig
Ki
nM
ΔG°
kcal/mole
IC50
nM
Kd
nM
EC50/IC50
nM
koff
s-1
kon
M-1s-1
pHTemp
°C
Epidermal growth factor receptor
(Homo sapiens (Human))
BDBM50172063
(CHEMBL3805849)
Show SMILES Clc1ccc(cc1Cl)C1CC(=NN1c1ccccc1)c1ccc2OCCOc2c1 |c:11|
Show InChI InChI=1S/C23H18Cl2N2O2/c24-18-8-6-16(12-19(18)25)21-14-20(26-27(21)17-4-2-1-3-5-17)15-7-9-22-23(13-15)29-11-10-28-22/h1-9,12-13,21H,10-11,14H2
n/an/a 1.92E+5n/an/an/an/an/an/a
Nanjing University
Curated by ChEMBL
Assay Description
Inhibition of recombinant His6-tagged EGFR (unknown origin) cytoplasmic domain (645 to 1186 residues) autophosphorylation expressed in baculovirus in...
Bioorg Med Chem 24: 3052-3061 (2016)
BindingDB Entry DOI: 10.7270/Q2HX1FKZ
Serine/threonine-protein kinase B-raf
(Mus musculus)
BDBM50172063
(CHEMBL3805849)
Show SMILES Clc1ccc(cc1Cl)C1CC(=NN1c1ccccc1)c1ccc2OCCOc2c1 |c:11|
Show InChI InChI=1S/C23H18Cl2N2O2/c24-18-8-6-16(12-19(18)25)21-14-20(26-27(21)17-4-2-1-3-5-17)15-7-9-22-23(13-15)29-11-10-28-22/h1-9,12-13,21H,10-11,14H2
n/an/a 3.37E+3n/an/an/an/an/an/a
Nanjing University
Curated by ChEMBL
Assay Description
Inhibition of mouse wild type BRAF assessed as reduction in human full length N-terminal His-tagged MEK1 phosphorylation pre-incubated for 1 hr befor...
Bioorg Med Chem 24: 3052-3061 (2016)
BindingDB Entry DOI: 10.7270/Q2HX1FKZ
RAF proto-oncogene serine/threonine-protein kinase
(Mus musculus)
BDBM50172063
(CHEMBL3805849)
Show SMILES Clc1ccc(cc1Cl)C1CC(=NN1c1ccccc1)c1ccc2OCCOc2c1 |c:11|
Show InChI InChI=1S/C23H18Cl2N2O2/c24-18-8-6-16(12-19(18)25)21-14-20(26-27(21)17-4-2-1-3-5-17)15-7-9-22-23(13-15)29-11-10-28-22/h1-9,12-13,21H,10-11,14H2
n/an/a 8.35E+3n/an/an/an/an/an/a
Nanjing University
Curated by ChEMBL
Assay Description
Inhibition of mouse c-Raf assessed as reduction in human full length N-terminal His-tagged MEK1 phosphorylation pre-incubated for 1 hr before MEK1 ad...
Bioorg Med Chem 24: 3052-3061 (2016)
BindingDB Entry DOI: 10.7270/Q2HX1FKZ