BDBM50176909 CHEBI:16227::PYRIDINE::Pyridine
SMILES: c1ccncc1
InChI Key: InChIKey=JUJWROOIHBZHMG-UHFFFAOYSA-N
Data: 1 IC50  1 Kd
Activity Spreadsheet -- Enzyme Inhibition Constant Data from BindingDB
Found 2 hits for monomerid = 50176909
Trg + Lig
Ki
nM
ΔG°
kcal/mole
IC50
nM
Kd
nM
EC50/IC50
nM
koff
s-1
kon
M-1s-1
pHTemp
°C
Cytochrome P450 3A4
(Homo sapiens (Human))
BDBM50176909
(CHEBI:16227 | PYRIDINE | Pyridine)
Show SMILES c1ccncc1
Show InChI InChI=1S/C5H5N/c1-2-4-6-5-3-1/h1-5H
Reactome pathway
n/an/an/a 4.50E+6n/an/an/an/an/a
University of California-Irvine
Curated by ChEMBL
Assay Description
Binding affinity to C-terminal four-histidine tagged human CYP3A4delta3 to 24 residues expressed in Escherichia coli assessed as spectral dissociatio...
J Med Chem 59: 4210-20 (2016)
BindingDB Entry DOI: 10.7270/Q2Q52RKB
Cytochrome P450 3A4
(Homo sapiens (Human))
BDBM50176909
(CHEBI:16227 | PYRIDINE | Pyridine)
Show SMILES c1ccncc1
Show InChI InChI=1S/C5H5N/c1-2-4-6-5-3-1/h1-5H
Reactome pathway
n/an/a 4.00E+6n/an/an/an/an/an/a
University of California-Irvine
Curated by ChEMBL
Assay Description
Inhibition of C-terminal four-histidine tagged human CYP3A4delta3 to 24 residues expressed in Escherichia coli assessed as 7-benzyloxy-4-(trifluorome...
J Med Chem 59: 4210-20 (2016)
BindingDB Entry DOI: 10.7270/Q2Q52RKB