BDBM50183444 CHEMBL3823651
SMILES: OC(C1CCOCC1)(c1cccs1)c1ccc2ccccc2c1
InChI Key: InChIKey=WJBBGPJKRLPXHY-UHFFFAOYSA-N
Data: 1 IC50
Activity Spreadsheet -- Enzyme Inhibition Constant Data from BindingDB
Found 1 hit for monomerid = 50183444
Trg + Lig
Ki
nM
ΔG°
kcal/mole
IC50
nM
Kd
nM
EC50/IC50
nM
koff
s-1
kon
M-1s-1
pHTemp
°C
Protein-S-isoprenylcysteine O-methyltransferase
(Homo sapiens (Human))
BDBM50183444
(CHEMBL3823651)
Show SMILES OC(C1CCOCC1)(c1cccs1)c1ccc2ccccc2c1
Show InChI InChI=1S/C20H20O2S/c21-20(19-6-3-13-23-19,17-9-11-22-12-10-17)18-8-7-15-4-1-2-5-16(15)14-18/h1-8,13-14,17,21H,9-12H2
n/an/a 2.20E+3n/an/an/an/an/an/a
Icahn School of Medicine at Mount Sinai
Curated by ChEMBL
Assay Description
Inhibition of human isoprenylcysteine carboxyl methyltransferase expressed in yeast His10myc3N-Icmt membranes using AFC substrate and [14C]-SAM and i...
Medchemcomm 7: 1016-1021 (2016)
BindingDB Entry DOI: 10.7270/Q2C82C8P