BDBM50189434 CHEMBL3828221
SMILES: Cn1cc(cn1)-c1ccc(cc1)-c1cncc2ccc(nc12)-c1nccn1C
InChI Key: InChIKey=WJORYPIALAWPKB-UHFFFAOYSA-N
Data: 2 IC50
Activity Spreadsheet -- Enzyme Inhibition Constant Data from BindingDB
Found 2 hits for monomerid = 50189434
Trg + Lig
Ki
nM
ΔG°
kcal/mole
IC50
nM
Kd
nM
EC50/IC50
nM
koff
s-1
kon
M-1s-1
pHTemp
°C
Cyclin-C
(Homo sapiens (Human))
BDBM50189434
(CHEMBL3828221)
Show SMILES Cn1cc(cn1)-c1ccc(cc1)-c1cncc2ccc(nc12)-c1nccn1C
Show InChI InChI=1S/C22H18N6/c1-27-10-9-24-22(27)20-8-7-17-11-23-13-19(21(17)26-20)16-5-3-15(4-6-16)18-12-25-28(2)14-18/h3-14H,1-2H3
n/an/a 0.710n/an/an/an/an/an/a
The Institute of Cancer Research
Curated by ChEMBL
Assay Description
Competitive binding affinity to full length His-tagged human recombinant CDK8/cyclin C expressed in baculovirus after 20 mins in presence of Alexa647...
ACS Med Chem Lett 7: 573-8 (2016)
BindingDB Entry DOI: 10.7270/Q2N87CRB
Cyclin-dependent kinase 8
(Homo sapiens (Human))
BDBM50189434
(CHEMBL3828221)
Show SMILES Cn1cc(cn1)-c1ccc(cc1)-c1cncc2ccc(nc12)-c1nccn1C
Show InChI InChI=1S/C22H18N6/c1-27-10-9-24-22(27)20-8-7-17-11-23-13-19(21(17)26-20)16-5-3-15(4-6-16)18-12-25-28(2)14-18/h3-14H,1-2H3
Reactome pathway
n/an/a 4.70n/an/an/an/an/an/a
The Institute of Cancer Research
Curated by ChEMBL
Assay Description
Binding affinity to CDK8 (unknown origin) expressed in human 7dF3 cells preincubated for 2 hrs followed by beta-oestradiol addition measured after 24...
ACS Med Chem Lett 7: 573-8 (2016)
BindingDB Entry DOI: 10.7270/Q2N87CRB