BDBM50195001 4-(3-chloro-4-fluorophenylamino)-6-(furan-2-ylmethylamino)quinoline-3-carbonitrile::CHEMBL222467
SMILES: Fc1ccc(Nc2c(cnc3ccc(NCc4ccco4)cc23)C#N)cc1Cl
InChI Key: InChIKey=ONSPZMHLRAYQTO-UHFFFAOYSA-N
Data: 1 IC50
Activity Spreadsheet -- Enzyme Inhibition Constant Data from BindingDB
Found 1 hit for monomerid = 50195001
Trg + Lig
Ki
nM
ΔG°
kcal/mole
IC50
nM
Kd
nM
EC50/IC50
nM
koff
s-1
kon
M-1s-1
pHTemp
°C
Mitogen-activated protein kinase kinase kinase 8
(Homo sapiens (Human))
BDBM50195001
(4-(3-chloro-4-fluorophenylamino)-6-(furan-2-ylmeth...)
Show SMILES Fc1ccc(Nc2c(cnc3ccc(NCc4ccco4)cc23)C#N)cc1Cl
Show InChI InChI=1S/C21H14ClFN4O/c22-18-9-15(3-5-19(18)23)27-21-13(10-24)11-26-20-6-4-14(8-17(20)21)25-12-16-2-1-7-28-16/h1-9,11,25H,12H2,(H,26,27)
NCI pathway
Reactome pathway
n/an/a 240n/an/an/an/an/an/a
Wyeth Research
Curated by ChEMBL
Assay Description
Inhibition of Tpl2 kinase by ELISA
Bioorg Med Chem Lett 16: 6067-72 (2006)
Article DOI: 10.1016/j.bmcl.2006.08.102
BindingDB Entry DOI: 10.7270/Q2W958TR