BDBM50195490 2-((1s,4s)-4-(4-amino-3,5-dichloro-N-cyclopropylbenzamido)cyclohexanecarboxamido)acetic acid::CHEMBL374318
SMILES: Nc1c(Cl)cc(cc1Cl)C(=O)N(C1CC1)[C@H]1CC[C@H](CC1)C(=O)NCC(O)=O
InChI Key: InChIKey=PIVHVYCTSLIOPL-KLPPZKSPSA-N
Data: 2 KI  3 IC50
Activity Spreadsheet -- Enzyme Inhibition Constant Data from BindingDB
Found 5 hits for monomerid = 50195490
Trg + Lig
Ki
nM
ΔG°
kcal/mole
IC50
nM
Kd
nM
EC50/IC50
nM
koff
s-1
kon
M-1s-1
pHTemp
°C
11-beta-Hydroxysteroid Dehydrogenase 1 (11-beta-HSD1)
(Rattus norvegicus (rat))
BDBM50195490
(2-((1s,4s)-4-(4-amino-3,5-dichloro-N-cyclopropylbe...)
Show SMILES Nc1c(Cl)cc(cc1Cl)C(=O)N(C1CC1)[C@H]1CC[C@H](CC1)C(=O)NCC(O)=O |wU:15.16,18.23,(25.2,-26.37,;23.86,-25.6,;23.86,-24.05,;25.19,-23.27,;22.52,-23.29,;21.19,-24.06,;21.19,-25.6,;22.52,-26.37,;22.52,-27.91,;19.86,-23.29,;19.86,-21.75,;18.52,-24.06,;17.19,-23.29,;16.42,-21.95,;15.65,-23.29,;18.52,-25.6,;19.86,-26.36,;19.85,-27.91,;18.52,-28.68,;17.19,-27.9,;17.19,-26.37,;18.51,-30.22,;17.17,-30.98,;19.84,-30.99,;19.84,-32.53,;21.17,-33.31,;21.16,-34.85,;22.5,-32.54,)|
Show InChI InChI=1S/C19H23Cl2N3O4/c20-14-7-11(8-15(21)17(14)22)19(28)24(13-5-6-13)12-3-1-10(2-4-12)18(27)23-9-16(25)26/h7-8,10,12-13H,1-6,9,22H2,(H,23,27)(H,25,26)/t10-,12+
20n/an/an/an/an/an/an/an/a
Abbott Laboratories
Curated by ChEMBL
Assay Description
Inhibition of rat 11beta-HSD1
Bioorg Med Chem Lett 16: 6241-5 (2006)
Article DOI: 10.1016/j.bmcl.2006.09.035
BindingDB Entry DOI: 10.7270/Q2B857R4
11-beta-hydroxysteroid dehydrogenase 1
(Homo sapiens (Human))
BDBM50195490
(2-((1s,4s)-4-(4-amino-3,5-dichloro-N-cyclopropylbe...)
Show SMILES Nc1c(Cl)cc(cc1Cl)C(=O)N(C1CC1)[C@H]1CC[C@H](CC1)C(=O)NCC(O)=O |wU:15.16,18.23,(25.2,-26.37,;23.86,-25.6,;23.86,-24.05,;25.19,-23.27,;22.52,-23.29,;21.19,-24.06,;21.19,-25.6,;22.52,-26.37,;22.52,-27.91,;19.86,-23.29,;19.86,-21.75,;18.52,-24.06,;17.19,-23.29,;16.42,-21.95,;15.65,-23.29,;18.52,-25.6,;19.86,-26.36,;19.85,-27.91,;18.52,-28.68,;17.19,-27.9,;17.19,-26.37,;18.51,-30.22,;17.17,-30.98,;19.84,-30.99,;19.84,-32.53,;21.17,-33.31,;21.16,-34.85,;22.5,-32.54,)|
Show InChI InChI=1S/C19H23Cl2N3O4/c20-14-7-11(8-15(21)17(14)22)19(28)24(13-5-6-13)12-3-1-10(2-4-12)18(27)23-9-16(25)26/h7-8,10,12-13H,1-6,9,22H2,(H,23,27)(H,25,26)/t10-,12+
Reactome pathway
700n/an/an/an/an/an/an/an/a
Abbott Laboratories
Curated by ChEMBL
Assay Description
Inhibition of human 11beta-HSD1 expressed in Escherichia coli by SPA
Bioorg Med Chem Lett 16: 6241-5 (2006)
Article DOI: 10.1016/j.bmcl.2006.09.035
BindingDB Entry DOI: 10.7270/Q2B857R4
11-beta-hydroxysteroid dehydrogenase 1
(Homo sapiens (Human))
BDBM50195490
(2-((1s,4s)-4-(4-amino-3,5-dichloro-N-cyclopropylbe...)
Show SMILES Nc1c(Cl)cc(cc1Cl)C(=O)N(C1CC1)[C@H]1CC[C@H](CC1)C(=O)NCC(O)=O |wU:15.16,18.23,(25.2,-26.37,;23.86,-25.6,;23.86,-24.05,;25.19,-23.27,;22.52,-23.29,;21.19,-24.06,;21.19,-25.6,;22.52,-26.37,;22.52,-27.91,;19.86,-23.29,;19.86,-21.75,;18.52,-24.06,;17.19,-23.29,;16.42,-21.95,;15.65,-23.29,;18.52,-25.6,;19.86,-26.36,;19.85,-27.91,;18.52,-28.68,;17.19,-27.9,;17.19,-26.37,;18.51,-30.22,;17.17,-30.98,;19.84,-30.99,;19.84,-32.53,;21.17,-33.31,;21.16,-34.85,;22.5,-32.54,)|
Show InChI InChI=1S/C19H23Cl2N3O4/c20-14-7-11(8-15(21)17(14)22)19(28)24(13-5-6-13)12-3-1-10(2-4-12)18(27)23-9-16(25)26/h7-8,10,12-13H,1-6,9,22H2,(H,23,27)(H,25,26)/t10-,12+
Reactome pathway
n/an/a>3.00E+4n/an/an/an/an/an/a
Abbott Laboratories
Curated by ChEMBL
Assay Description
Inhibition of human 11beta-HSD1 expressed in HEK293 cells by fluorescence polarization immuno-assay
Bioorg Med Chem Lett 16: 6241-5 (2006)
Article DOI: 10.1016/j.bmcl.2006.09.035
BindingDB Entry DOI: 10.7270/Q2B857R4
11-beta-hydroxysteroid dehydrogenase 2
(Homo sapiens (Human))
BDBM50195490
(2-((1s,4s)-4-(4-amino-3,5-dichloro-N-cyclopropylbe...)
Show SMILES Nc1c(Cl)cc(cc1Cl)C(=O)N(C1CC1)[C@H]1CC[C@H](CC1)C(=O)NCC(O)=O |wU:15.16,18.23,(25.2,-26.37,;23.86,-25.6,;23.86,-24.05,;25.19,-23.27,;22.52,-23.29,;21.19,-24.06,;21.19,-25.6,;22.52,-26.37,;22.52,-27.91,;19.86,-23.29,;19.86,-21.75,;18.52,-24.06,;17.19,-23.29,;16.42,-21.95,;15.65,-23.29,;18.52,-25.6,;19.86,-26.36,;19.85,-27.91,;18.52,-28.68,;17.19,-27.9,;17.19,-26.37,;18.51,-30.22,;17.17,-30.98,;19.84,-30.99,;19.84,-32.53,;21.17,-33.31,;21.16,-34.85,;22.5,-32.54,)|
Show InChI InChI=1S/C19H23Cl2N3O4/c20-14-7-11(8-15(21)17(14)22)19(28)24(13-5-6-13)12-3-1-10(2-4-12)18(27)23-9-16(25)26/h7-8,10,12-13H,1-6,9,22H2,(H,23,27)(H,25,26)/t10-,12+
n/an/a>1.00E+4n/an/an/an/an/an/a
Abbott Laboratories
Curated by ChEMBL
Assay Description
Inhibition of human 11beta-HSD2 by SPA
Bioorg Med Chem Lett 16: 6241-5 (2006)
Article DOI: 10.1016/j.bmcl.2006.09.035
BindingDB Entry DOI: 10.7270/Q2B857R4
11-beta-hydroxysteroid dehydrogenase 2
(Rattus norvegicus)
BDBM50195490
(2-((1s,4s)-4-(4-amino-3,5-dichloro-N-cyclopropylbe...)
Show SMILES Nc1c(Cl)cc(cc1Cl)C(=O)N(C1CC1)[C@H]1CC[C@H](CC1)C(=O)NCC(O)=O |wU:15.16,18.23,(25.2,-26.37,;23.86,-25.6,;23.86,-24.05,;25.19,-23.27,;22.52,-23.29,;21.19,-24.06,;21.19,-25.6,;22.52,-26.37,;22.52,-27.91,;19.86,-23.29,;19.86,-21.75,;18.52,-24.06,;17.19,-23.29,;16.42,-21.95,;15.65,-23.29,;18.52,-25.6,;19.86,-26.36,;19.85,-27.91,;18.52,-28.68,;17.19,-27.9,;17.19,-26.37,;18.51,-30.22,;17.17,-30.98,;19.84,-30.99,;19.84,-32.53,;21.17,-33.31,;21.16,-34.85,;22.5,-32.54,)|
Show InChI InChI=1S/C19H23Cl2N3O4/c20-14-7-11(8-15(21)17(14)22)19(28)24(13-5-6-13)12-3-1-10(2-4-12)18(27)23-9-16(25)26/h7-8,10,12-13H,1-6,9,22H2,(H,23,27)(H,25,26)/t10-,12+
n/an/a>1.00E+4n/an/an/an/an/an/a
Abbott Laboratories
Curated by ChEMBL
Assay Description
Inhibition of rat 11beta-HSD2
Bioorg Med Chem Lett 16: 6241-5 (2006)
Article DOI: 10.1016/j.bmcl.2006.09.035
BindingDB Entry DOI: 10.7270/Q2B857R4