BDBM50198618 CHEMBL3958051
SMILES: COc1ccc(\C=C\C(=O)CC(=O)\C=C\c2ccc(O)c(OC)c2)cc1O
InChI Key: InChIKey=JPUDEIBVUZNDCK-FCXRPNKRSA-N
Data: 1 IC50
Activity Spreadsheet -- Enzyme Inhibition Constant Data from BindingDB
Found 1 hit for monomerid = 50198618
Trg + Lig
Ki
nM
ΔG°
kcal/mole
IC50
nM
Kd
nM
EC50/IC50
nM
koff
s-1
kon
M-1s-1
pHTemp
°C
Tau
(Homo sapiens (Human))
BDBM50198618
(CHEMBL3958051)
Show SMILES COc1ccc(\C=C\C(=O)CC(=O)\C=C\c2ccc(O)c(OC)c2)cc1O
Show InChI InChI=1S/C21H20O6/c1-26-20-10-6-14(11-19(20)25)3-7-16(22)13-17(23)8-4-15-5-9-18(24)21(12-15)27-2/h3-12,24-25H,13H2,1-2H3/b7-3+,8-4+
n/an/a 520n/an/an/an/an/an/a
Doshisha University
Curated by ChEMBL
Assay Description
Inhibition of recombinant human TAU three-repeat microtubule-binding domain aggregation expressed in Escherichia coli after 16 hrs by thioflavin T fl...
Bioorg Med Chem Lett 26: 5024-5028 (2016)
Article DOI: 10.1016/j.bmcl.2016.08.092
BindingDB Entry DOI: 10.7270/Q2833V0M