BDBM50198731 CHEMBL3951226
SMILES: COc1ccc(\C=C2/CN(Cc3c(nn(c23)-c2ccc(Cl)cc2Cl)C(=O)N[C@H](C)c2ccccn2)C(=O)CC(O)=O)cc1
InChI Key: InChIKey=ONGMGQZMIUDISF-JZQBQCRLSA-N
Data: 2 EC50
Activity Spreadsheet -- Enzyme Inhibition Constant Data from BindingDB
Found 2 hits for monomerid = 50198731
Trg + Lig
Ki
nM
ΔG°
kcal/mole
IC50
nM
Kd
nM
EC50/IC50
nM
koff
s-1
kon
M-1s-1
pHTemp
°C
Cannabinoid receptor 1
(Homo sapiens (Human))
BDBM50198731
(CHEMBL3951226)
Show SMILES COc1ccc(\C=C2/CN(Cc3c(nn(c23)-c2ccc(Cl)cc2Cl)C(=O)N[C@H](C)c2ccccn2)C(=O)CC(O)=O)cc1 |r|
Show InChI InChI=1S/C31H27Cl2N5O5/c1-18(25-5-3-4-12-34-25)35-31(42)29-23-17-37(27(39)15-28(40)41)16-20(13-19-6-9-22(43-2)10-7-19)30(23)38(36-29)26-11-8-21(32)14-24(26)33/h3-14,18H,15-17H2,1-2H3,(H,35,42)(H,40,41)/b20-13+/t18-/m1/s1
NCI pathway
Reactome pathway
n/an/an/an/a 11n/an/an/an/a
Janssen Research& Development, L.L.C.
Curated by ChEMBL
Assay Description
Inverse agonist activity at human CB1 receptor transfected in HEK293 cells assessed as increase of forskolin-induced cAMP production incubated for 30...
Bioorg Med Chem Lett 26: 5597-5601 (2016)
Article DOI: 10.1016/j.bmcl.2016.09.026
BindingDB Entry DOI: 10.7270/Q2GM898H
Cannabinoid receptor 2
(Homo sapiens (Human))
BDBM50198731
(CHEMBL3951226)
Show SMILES COc1ccc(\C=C2/CN(Cc3c(nn(c23)-c2ccc(Cl)cc2Cl)C(=O)N[C@H](C)c2ccccn2)C(=O)CC(O)=O)cc1 |r|
Show InChI InChI=1S/C31H27Cl2N5O5/c1-18(25-5-3-4-12-34-25)35-31(42)29-23-17-37(27(39)15-28(40)41)16-20(13-19-6-9-22(43-2)10-7-19)30(23)38(36-29)26-11-8-21(32)14-24(26)33/h3-14,18H,15-17H2,1-2H3,(H,35,42)(H,40,41)/b20-13+/t18-/m1/s1
Reactome pathway
n/an/an/an/a 1.94E+3n/an/an/an/a
Janssen Research& Development, L.L.C.
Curated by ChEMBL
Assay Description
Inverse agonist activity at human CB2 receptor transfected in HEK293 cells assessed as increase of forskolin-induced cAMP production incubated for 30...
Bioorg Med Chem Lett 26: 5597-5601 (2016)
Article DOI: 10.1016/j.bmcl.2016.09.026
BindingDB Entry DOI: 10.7270/Q2GM898H