null
SMILES: CC(=O)N1CCc2c(C1)c(Nc1cccc(c1)-c1ccccn1)nn2CC1CC1
InChI Key: InChIKey=YHBKXFFZZJCTSD-UHFFFAOYSA-N
Activity Spreadsheet -- Enzyme Inhibition Constant Data from BindingDB
Found 5 hits for monomerid = 50200397
Trg + Lig
Ki
nM
ΔG°
kcal/mole
IC50
nM
Kd
nM
EC50/IC50
nM
koff
s-1
kon
M-1s-1
pHTemp
°C
CREB-binding protein/Histone acetyltransferase p300
(Homo sapiens (Human))
BDBM50200397
(CHEMBL3973515 | US9763922, Example 79)
Show SMILES CC(=O)N1CCc2c(C1)c(Nc1cccc(c1)-c1ccccn1)nn2CC1CC1
Show InChI InChI=1S/C23H25N5O/c1-16(29)27-12-10-22-20(15-27)23(26-28(22)14-17-8-9-17)25-19-6-4-5-18(13-19)21-7-2-3-11-24-21/h2-7,11,13,17H,8-10,12,14-15H2,1H3,(H,25,26)
n/an/a 30n/an/an/an/an/an/a
Genentech
Curated by ChEMBL
Assay Description
Displacement of biotinylated ligand from recombinant His-tagged CBP/EP300 (unknown origin) measured after 10 mins by TR-FRET assay
J Med Chem 59: 10549-10563 (2016)
Article DOI: 10.1021/acs.jmedchem.6b01022
BindingDB Entry DOI: 10.7270/Q27083DF
CREB-binding protein/Histone acetyltransferase p300
(Homo sapiens (Human))
BDBM50200397
(CHEMBL3973515 | US9763922, Example 79)
Show SMILES CC(=O)N1CCc2c(C1)c(Nc1cccc(c1)-c1ccccn1)nn2CC1CC1
Show InChI InChI=1S/C23H25N5O/c1-16(29)27-12-10-22-20(15-27)23(26-28(22)14-17-8-9-17)25-19-6-4-5-18(13-19)21-7-2-3-11-24-21/h2-7,11,13,17H,8-10,12,14-15H2,1H3,(H,25,26)
n/an/a 560n/an/an/an/an/an/a
Genentech
Curated by ChEMBL
Assay Description
Inhibition of Halo-tagged histone H3.3 binding to CBP/EP300 (unknown origin) expressed in HEK293 cells measured after overnight incubation by lucifer...
J Med Chem 59: 10549-10563 (2016)
Article DOI: 10.1021/acs.jmedchem.6b01022
BindingDB Entry DOI: 10.7270/Q27083DF
Bromodomain-containing protein 4
(Homo sapiens (Human))
BDBM50200397
(CHEMBL3973515 | US9763922, Example 79)
Show SMILES CC(=O)N1CCc2c(C1)c(Nc1cccc(c1)-c1ccccn1)nn2CC1CC1
Show InChI InChI=1S/C23H25N5O/c1-16(29)27-12-10-22-20(15-27)23(26-28(22)14-17-8-9-17)25-19-6-4-5-18(13-19)21-7-2-3-11-24-21/h2-7,11,13,17H,8-10,12,14-15H2,1H3,(H,25,26)
US Patent
n/an/a 2.02E+3n/an/an/an/an/an/a
GENENTECH, INC.; CONSTELLATION PHARMACEUTICALS, INC.
US Patent
Assay Description
His/Flag epitope tagged BRD4 BD142-168 was cloned, expressed, and purified to. BRD4 binding and inhibition was assessed by monitoring the engagement ...
US Patent US9763922 (2017)
BindingDB Entry DOI: 10.7270/Q23N25G6
CREB-binding protein
(Homo sapiens (Human))
BDBM50200397
(CHEMBL3973515 | US9763922, Example 79)
Show SMILES CC(=O)N1CCc2c(C1)c(Nc1cccc(c1)-c1ccccn1)nn2CC1CC1
Show InChI InChI=1S/C23H25N5O/c1-16(29)27-12-10-22-20(15-27)23(26-28(22)14-17-8-9-17)25-19-6-4-5-18(13-19)21-7-2-3-11-24-21/h2-7,11,13,17H,8-10,12,14-15H2,1H3,(H,25,26)
Reactome pathway
US Patent
n/an/a 20n/an/an/an/an/an/a
GENENTECH, INC.; CONSTELLATION PHARMACEUTICALS, INC.
US Patent
Assay Description
His/Flag epitope tagged CBP was cloned, expressed, and purified to homogeneity. CBP binding and inhibition was assessed by monitoring the engagement ...
US Patent US9763922 (2017)
BindingDB Entry DOI: 10.7270/Q23N25G6
Bromodomain-containing protein 4
(Homo sapiens (Human))
BDBM50200397
(CHEMBL3973515 | US9763922, Example 79)
Show SMILES CC(=O)N1CCc2c(C1)c(Nc1cccc(c1)-c1ccccn1)nn2CC1CC1
Show InChI InChI=1S/C23H25N5O/c1-16(29)27-12-10-22-20(15-27)23(26-28(22)14-17-8-9-17)25-19-6-4-5-18(13-19)21-7-2-3-11-24-21/h2-7,11,13,17H,8-10,12,14-15H2,1H3,(H,25,26)
n/an/a 3.90E+3n/an/an/an/an/an/a
Genentech
Curated by ChEMBL
Assay Description
Displacement of biotinylated ligand from recombinant His-tagged BRD4 bromodomain-1 (unknown origin) measured after 10 mins by TR-FRET assay
J Med Chem 59: 10549-10563 (2016)
Article DOI: 10.1021/acs.jmedchem.6b01022
BindingDB Entry DOI: 10.7270/Q27083DF