BDBM50201275 7-fluoro-4-oxo-N-(1-(3-oxo-2,3,4,6,7,8-hexahydroindeno[5,6-b][1,4]oxazin-6-yl)piperidin-4-yl)-4H-chromene-2-carboxamide::CHEMBL384919
SMILES: Fc1ccc2c(c1)oc(cc2=O)C(=O)NC1CCN(CC1)C1CCc2cc3OCC(=O)Nc3cc12
InChI Key: InChIKey=YNFBUKHNBHSFFK-UHFFFAOYSA-N
Data: 2 IC50
Activity Spreadsheet -- Enzyme Inhibition Constant Data from BindingDB
Found 2 hits for monomerid = 50201275
Trg + Lig
Ki
nM
ΔG°
kcal/mole
IC50
nM
Kd
nM
EC50/IC50
nM
koff
s-1
kon
M-1s-1
pHTemp
°C
Melanin-concentrating hormone receptor
(Homo sapiens (Human))
BDBM50201275
(7-fluoro-4-oxo-N-(1-(3-oxo-2,3,4,6,7,8-hexahydroin...)
Show SMILES Fc1ccc2c(c1)oc(cc2=O)C(=O)NC1CCN(CC1)C1CCc2cc3OCC(=O)Nc3cc12
Show InChI InChI=1S/C26H24FN3O5/c27-15-2-3-17-21(31)12-24(35-22(17)10-15)26(33)28-16-5-7-30(8-6-16)20-4-1-14-9-23-19(11-18(14)20)29-25(32)13-34-23/h2-3,9-12,16,20H,1,4-8,13H2,(H,28,33)(H,29,32)
Reactome pathway
n/an/a 21n/an/an/an/an/an/a
Abbott Laboratories
Curated by ChEMBL
Assay Description
Displacement of 125I-MCH from MCH-R1 expressed in IMR-32 cells
Bioorg Med Chem Lett 17: 884-9 (2007)
Article DOI: 10.1016/j.bmcl.2006.11.061
BindingDB Entry DOI: 10.7270/Q2J38S6V
Potassium voltage-gated channel subfamily H member 2
(Homo sapiens (Human))
BDBM50201275
(7-fluoro-4-oxo-N-(1-(3-oxo-2,3,4,6,7,8-hexahydroin...)
Show SMILES Fc1ccc2c(c1)oc(cc2=O)C(=O)NC1CCN(CC1)C1CCc2cc3OCC(=O)Nc3cc12
Show InChI InChI=1S/C26H24FN3O5/c27-15-2-3-17-21(31)12-24(35-22(17)10-15)26(33)28-16-5-7-30(8-6-16)20-4-1-14-9-23-19(11-18(14)20)29-25(32)13-34-23/h2-3,9-12,16,20H,1,4-8,13H2,(H,28,33)(H,29,32)
Reactome pathway
n/an/a 1.46E+4n/an/an/an/an/an/a
Abbott Laboratories
Curated by ChEMBL
Assay Description
Displacement of 3H-dofetilide from hERG-expressing HEK membrane homogenates
Bioorg Med Chem Lett 17: 884-9 (2007)
Article DOI: 10.1016/j.bmcl.2006.11.061
BindingDB Entry DOI: 10.7270/Q2J38S6V