BDBM50209158 2-(4-methyl-piperazin-1-yl)-N-{3-[5-(3-phenoxy-prop-1-ynyl)-thiophen-3-yl]-2,4-dihydro-indeno[1,2-c]pyrazol-5-yl}-acetamide::CHEMBL245377
SMILES: CN1CCN(CC(=O)Nc2cccc-3c2Cc2c-3n[nH]c2-c2csc(c2)C#CCOc2ccccc2)CC1
InChI Key: InChIKey=OPPRLSONSGULSP-UHFFFAOYSA-N
Data: 11 IC50
Activity Spreadsheet -- Enzyme Inhibition Constant Data from BindingDB
Found 11 hits for monomerid = 50209158
Trg + Lig
Ki
nM
ΔG°
kcal/mole
IC50
nM
Kd
nM
EC50/IC50
nM
koff
s-1
kon
M-1s-1
pHTemp
°C
Vascular endothelial growth factor receptor 2
(Homo sapiens (Human))
BDBM50209158
(2-(4-methyl-piperazin-1-yl)-N-{3-[5-(3-phenoxy-pro...)
Show SMILES CN1CCN(CC(=O)Nc2cccc-3c2Cc2c-3n[nH]c2-c2csc(c2)C#CCOc2ccccc2)CC1
Show InChI InChI=1S/C30H29N5O2S/c1-34-12-14-35(15-13-34)19-28(36)31-27-11-5-10-24-25(27)18-26-29(32-33-30(24)26)21-17-23(38-20-21)9-6-16-37-22-7-3-2-4-8-22/h2-5,7-8,10-11,17,20H,12-16,18-19H2,1H3,(H,31,36)(H,32,33)
NCI pathway
Reactome pathway
n/an/a 10n/an/an/an/an/an/a
Abbott Laboratories
Curated by ChEMBL
Assay Description
Inhibition of KDR by HTRF assay
Bioorg Med Chem Lett 17: 3136-40 (2007)
Article DOI: 10.1016/j.bmcl.2007.03.031
BindingDB Entry DOI: 10.7270/Q2VD6Z3Q
Tyrosine-protein kinase Lyn
(Homo sapiens (Human))
BDBM50209158
(2-(4-methyl-piperazin-1-yl)-N-{3-[5-(3-phenoxy-pro...)
Show SMILES CN1CCN(CC(=O)Nc2cccc-3c2Cc2c-3n[nH]c2-c2csc(c2)C#CCOc2ccccc2)CC1
Show InChI InChI=1S/C30H29N5O2S/c1-34-12-14-35(15-13-34)19-28(36)31-27-11-5-10-24-25(27)18-26-29(32-33-30(24)26)21-17-23(38-20-21)9-6-16-37-22-7-3-2-4-8-22/h2-5,7-8,10-11,17,20H,12-16,18-19H2,1H3,(H,31,36)(H,32,33)
Reactome pathway
n/an/a>5.00E+4n/an/an/an/an/an/a
Abbott Laboratories
Curated by ChEMBL
Assay Description
Inhibition of Lyn by HTRF assay
Bioorg Med Chem Lett 17: 3136-40 (2007)
Article DOI: 10.1016/j.bmcl.2007.03.031
BindingDB Entry DOI: 10.7270/Q2VD6Z3Q
Macrophage colony stimulating factor receptor
(Homo sapiens (Human))
BDBM50209158
(2-(4-methyl-piperazin-1-yl)-N-{3-[5-(3-phenoxy-pro...)
Show SMILES CN1CCN(CC(=O)Nc2cccc-3c2Cc2c-3n[nH]c2-c2csc(c2)C#CCOc2ccccc2)CC1
Show InChI InChI=1S/C30H29N5O2S/c1-34-12-14-35(15-13-34)19-28(36)31-27-11-5-10-24-25(27)18-26-29(32-33-30(24)26)21-17-23(38-20-21)9-6-16-37-22-7-3-2-4-8-22/h2-5,7-8,10-11,17,20H,12-16,18-19H2,1H3,(H,31,36)(H,32,33)
n/an/a 45n/an/an/an/an/an/a
Abbott Laboratories
Curated by ChEMBL
Assay Description
Inhibition of CSF1R by HTRF assay
Bioorg Med Chem Lett 17: 3136-40 (2007)
Article DOI: 10.1016/j.bmcl.2007.03.031
BindingDB Entry DOI: 10.7270/Q2VD6Z3Q
Proto-oncogene tyrosine-protein kinase Src
(Homo sapiens (Human))
BDBM50209158
(2-(4-methyl-piperazin-1-yl)-N-{3-[5-(3-phenoxy-pro...)
Show SMILES CN1CCN(CC(=O)Nc2cccc-3c2Cc2c-3n[nH]c2-c2csc(c2)C#CCOc2ccccc2)CC1
Show InChI InChI=1S/C30H29N5O2S/c1-34-12-14-35(15-13-34)19-28(36)31-27-11-5-10-24-25(27)18-26-29(32-33-30(24)26)21-17-23(38-20-21)9-6-16-37-22-7-3-2-4-8-22/h2-5,7-8,10-11,17,20H,12-16,18-19H2,1H3,(H,31,36)(H,32,33)
n/an/a>5.00E+4n/an/an/an/an/an/a
Abbott Laboratories
Curated by ChEMBL
Assay Description
Inhibition of Src by HTRF assay
Bioorg Med Chem Lett 17: 3136-40 (2007)
Article DOI: 10.1016/j.bmcl.2007.03.031
BindingDB Entry DOI: 10.7270/Q2VD6Z3Q
Tyrosine-protein kinase HCK
(Homo sapiens (Human))
BDBM50209158
(2-(4-methyl-piperazin-1-yl)-N-{3-[5-(3-phenoxy-pro...)
Show SMILES CN1CCN(CC(=O)Nc2cccc-3c2Cc2c-3n[nH]c2-c2csc(c2)C#CCOc2ccccc2)CC1
Show InChI InChI=1S/C30H29N5O2S/c1-34-12-14-35(15-13-34)19-28(36)31-27-11-5-10-24-25(27)18-26-29(32-33-30(24)26)21-17-23(38-20-21)9-6-16-37-22-7-3-2-4-8-22/h2-5,7-8,10-11,17,20H,12-16,18-19H2,1H3,(H,31,36)(H,32,33)
Reactome pathway
n/an/a>5.00E+4n/an/an/an/an/an/a
Abbott Laboratories
Curated by ChEMBL
Assay Description
Inhibition of Hck by HTRF assay
Bioorg Med Chem Lett 17: 3136-40 (2007)
Article DOI: 10.1016/j.bmcl.2007.03.031
BindingDB Entry DOI: 10.7270/Q2VD6Z3Q
Tyrosine-protein kinase Fyn
(Homo sapiens (Human))
BDBM50209158
(2-(4-methyl-piperazin-1-yl)-N-{3-[5-(3-phenoxy-pro...)
Show SMILES CN1CCN(CC(=O)Nc2cccc-3c2Cc2c-3n[nH]c2-c2csc(c2)C#CCOc2ccccc2)CC1
Show InChI InChI=1S/C30H29N5O2S/c1-34-12-14-35(15-13-34)19-28(36)31-27-11-5-10-24-25(27)18-26-29(32-33-30(24)26)21-17-23(38-20-21)9-6-16-37-22-7-3-2-4-8-22/h2-5,7-8,10-11,17,20H,12-16,18-19H2,1H3,(H,31,36)(H,32,33)
n/an/a>5.00E+4n/an/an/an/an/an/a
Abbott Laboratories
Curated by ChEMBL
Assay Description
Inhibition of Fyn by HTRF assay
Bioorg Med Chem Lett 17: 3136-40 (2007)
Article DOI: 10.1016/j.bmcl.2007.03.031
BindingDB Entry DOI: 10.7270/Q2VD6Z3Q
Angiopoietin-1 receptor
(Homo sapiens (Human))
BDBM50209158
(2-(4-methyl-piperazin-1-yl)-N-{3-[5-(3-phenoxy-pro...)
Show SMILES CN1CCN(CC(=O)Nc2cccc-3c2Cc2c-3n[nH]c2-c2csc(c2)C#CCOc2ccccc2)CC1
Show InChI InChI=1S/C30H29N5O2S/c1-34-12-14-35(15-13-34)19-28(36)31-27-11-5-10-24-25(27)18-26-29(32-33-30(24)26)21-17-23(38-20-21)9-6-16-37-22-7-3-2-4-8-22/h2-5,7-8,10-11,17,20H,12-16,18-19H2,1H3,(H,31,36)(H,32,33)
n/an/a 4.88E+3n/an/an/an/an/an/a
Abbott Laboratories
Curated by ChEMBL
Assay Description
Inhibition of Tie2 by HTRF assay
Bioorg Med Chem Lett 17: 3136-40 (2007)
Article DOI: 10.1016/j.bmcl.2007.03.031
BindingDB Entry DOI: 10.7270/Q2VD6Z3Q
Vascular endothelial growth factor receptor 1
(Homo sapiens (Human))
BDBM50209158
(2-(4-methyl-piperazin-1-yl)-N-{3-[5-(3-phenoxy-pro...)
Show SMILES CN1CCN(CC(=O)Nc2cccc-3c2Cc2c-3n[nH]c2-c2csc(c2)C#CCOc2ccccc2)CC1
Show InChI InChI=1S/C30H29N5O2S/c1-34-12-14-35(15-13-34)19-28(36)31-27-11-5-10-24-25(27)18-26-29(32-33-30(24)26)21-17-23(38-20-21)9-6-16-37-22-7-3-2-4-8-22/h2-5,7-8,10-11,17,20H,12-16,18-19H2,1H3,(H,31,36)(H,32,33)
n/an/a 6n/an/an/an/an/an/a
Abbott Laboratories
Curated by ChEMBL
Assay Description
Inhibition of Flt1 by HTRF assay
Bioorg Med Chem Lett 17: 3136-40 (2007)
Article DOI: 10.1016/j.bmcl.2007.03.031
BindingDB Entry DOI: 10.7270/Q2VD6Z3Q
Receptor-type tyrosine-protein kinase FLT3
(Homo sapiens (Human))
BDBM50209158
(2-(4-methyl-piperazin-1-yl)-N-{3-[5-(3-phenoxy-pro...)
Show SMILES CN1CCN(CC(=O)Nc2cccc-3c2Cc2c-3n[nH]c2-c2csc(c2)C#CCOc2ccccc2)CC1
Show InChI InChI=1S/C30H29N5O2S/c1-34-12-14-35(15-13-34)19-28(36)31-27-11-5-10-24-25(27)18-26-29(32-33-30(24)26)21-17-23(38-20-21)9-6-16-37-22-7-3-2-4-8-22/h2-5,7-8,10-11,17,20H,12-16,18-19H2,1H3,(H,31,36)(H,32,33)
n/an/a 22n/an/an/an/an/an/a
Abbott Laboratories
Curated by ChEMBL
Assay Description
Inhibition of Flt3 by HTRF assay
Bioorg Med Chem Lett 17: 3136-40 (2007)
Article DOI: 10.1016/j.bmcl.2007.03.031
BindingDB Entry DOI: 10.7270/Q2VD6Z3Q
Mast/stem cell growth factor receptor Kit
(Homo sapiens (Human))
BDBM50209158
(2-(4-methyl-piperazin-1-yl)-N-{3-[5-(3-phenoxy-pro...)
Show SMILES CN1CCN(CC(=O)Nc2cccc-3c2Cc2c-3n[nH]c2-c2csc(c2)C#CCOc2ccccc2)CC1
Show InChI InChI=1S/C30H29N5O2S/c1-34-12-14-35(15-13-34)19-28(36)31-27-11-5-10-24-25(27)18-26-29(32-33-30(24)26)21-17-23(38-20-21)9-6-16-37-22-7-3-2-4-8-22/h2-5,7-8,10-11,17,20H,12-16,18-19H2,1H3,(H,31,36)(H,32,33)
n/an/a 49n/an/an/an/an/an/a
Abbott Laboratories
Curated by ChEMBL
Assay Description
Inhibition of c-Kit by HTRF assay
Bioorg Med Chem Lett 17: 3136-40 (2007)
Article DOI: 10.1016/j.bmcl.2007.03.031
BindingDB Entry DOI: 10.7270/Q2VD6Z3Q
Tyrosine-protein kinase Lck
(Homo sapiens (Human))
BDBM50209158
(2-(4-methyl-piperazin-1-yl)-N-{3-[5-(3-phenoxy-pro...)
Show SMILES CN1CCN(CC(=O)Nc2cccc-3c2Cc2c-3n[nH]c2-c2csc(c2)C#CCOc2ccccc2)CC1
Show InChI InChI=1S/C30H29N5O2S/c1-34-12-14-35(15-13-34)19-28(36)31-27-11-5-10-24-25(27)18-26-29(32-33-30(24)26)21-17-23(38-20-21)9-6-16-37-22-7-3-2-4-8-22/h2-5,7-8,10-11,17,20H,12-16,18-19H2,1H3,(H,31,36)(H,32,33)
n/an/a 3.10E+4n/an/an/an/an/an/a
Abbott Laboratories
Curated by ChEMBL
Assay Description
Inhibition of Lck by HTRF assay
Bioorg Med Chem Lett 17: 3136-40 (2007)
Article DOI: 10.1016/j.bmcl.2007.03.031
BindingDB Entry DOI: 10.7270/Q2VD6Z3Q