BDBM50215781 2-(pyridin-4-ylmethylamino)-N-(2,2,3,3-tetrafluoro-2,3-dihydrobenzo[b][1,4]dioxin-6-yl)benzamide::CHEMBL391781
SMILES: FC1(F)Oc2ccc(NC(=O)c3ccccc3NCc3ccncc3)cc2OC1(F)F
InChI Key: InChIKey=DKDIYRYSJHNWTO-UHFFFAOYSA-N
Data: 2 IC50
Activity Spreadsheet -- Enzyme Inhibition Constant Data from BindingDB
Found 2 hits for monomerid = 50215781
Trg + Lig
Ki
nM
ΔG°
kcal/mole
IC50
nM
Kd
nM
EC50/IC50
nM
koff
s-1
kon
M-1s-1
pHTemp
°C
Mast/stem cell growth factor receptor Kit
(Homo sapiens (Human))
BDBM50215781
(2-(pyridin-4-ylmethylamino)-N-(2,2,3,3-tetrafluoro...)
Show SMILES FC1(F)Oc2ccc(NC(=O)c3ccccc3NCc3ccncc3)cc2OC1(F)F
Show InChI InChI=1S/C21H15F4N3O3/c22-20(23)21(24,25)31-18-11-14(5-6-17(18)30-20)28-19(29)15-3-1-2-4-16(15)27-12-13-7-9-26-10-8-13/h1-11,27H,12H2,(H,28,29)
n/an/a 19n/an/an/an/an/an/a
Bayer Research Center
Curated by ChEMBL
Assay Description
Inhibition of human recombinant cKit by FRET assay
Bioorg Med Chem Lett 17: 4378-81 (2007)
Article DOI: 10.1016/j.bmcl.2007.02.075
BindingDB Entry DOI: 10.7270/Q28K78S7
Serine/threonine-protein kinase B-raf
(Homo sapiens (Human))
BDBM50215781
(2-(pyridin-4-ylmethylamino)-N-(2,2,3,3-tetrafluoro...)
Show SMILES FC1(F)Oc2ccc(NC(=O)c3ccccc3NCc3ccncc3)cc2OC1(F)F
Show InChI InChI=1S/C21H15F4N3O3/c22-20(23)21(24,25)31-18-11-14(5-6-17(18)30-20)28-19(29)15-3-1-2-4-16(15)27-12-13-7-9-26-10-8-13/h1-11,27H,12H2,(H,28,29)
NCI pathway
Reactome pathway
n/an/a 40n/an/an/an/an/an/a
Bayer Research Center
Curated by ChEMBL
Assay Description
Inhibition of b-Raf
Bioorg Med Chem Lett 17: 4378-81 (2007)
Article DOI: 10.1016/j.bmcl.2007.02.075
BindingDB Entry DOI: 10.7270/Q28K78S7