BDBM50215782 CHEMBL398052::N-(2,2-difluorobenzo[d][1,3]dioxol-5-yl)-2-((2-(2-hydroxyethylamino)pyridin-4-yl)methylamino)benzamide
SMILES: OCCNc1cc(CNc2ccccc2C(=O)Nc2ccc3OC(F)(F)Oc3c2)ccn1
InChI Key: InChIKey=MBUPGYAZYBFASN-UHFFFAOYSA-N
Data: 2 IC50
Activity Spreadsheet -- Enzyme Inhibition Constant Data from BindingDB
Found 2 hits for monomerid = 50215782
Trg + Lig
Ki
nM
ΔG°
kcal/mole
IC50
nM
Kd
nM
EC50/IC50
nM
koff
s-1
kon
M-1s-1
pHTemp
°C
Mast/stem cell growth factor receptor Kit
(Homo sapiens (Human))
BDBM50215782
(CHEMBL398052 | N-(2,2-difluorobenzo[d][1,3]dioxol-...)
Show SMILES OCCNc1cc(CNc2ccccc2C(=O)Nc2ccc3OC(F)(F)Oc3c2)ccn1
Show InChI InChI=1S/C22H20F2N4O4/c23-22(24)31-18-6-5-15(12-19(18)32-22)28-21(30)16-3-1-2-4-17(16)27-13-14-7-8-25-20(11-14)26-9-10-29/h1-8,11-12,27,29H,9-10,13H2,(H,25,26)(H,28,30)
n/an/a 8n/an/an/an/an/an/a
Bayer Research Center
Curated by ChEMBL
Assay Description
Inhibition of human recombinant cKit by FRET assay
Bioorg Med Chem Lett 17: 4378-81 (2007)
Article DOI: 10.1016/j.bmcl.2007.02.075
BindingDB Entry DOI: 10.7270/Q28K78S7
Serine/threonine-protein kinase B-raf
(Homo sapiens (Human))
BDBM50215782
(CHEMBL398052 | N-(2,2-difluorobenzo[d][1,3]dioxol-...)
Show SMILES OCCNc1cc(CNc2ccccc2C(=O)Nc2ccc3OC(F)(F)Oc3c2)ccn1
Show InChI InChI=1S/C22H20F2N4O4/c23-22(24)31-18-6-5-15(12-19(18)32-22)28-21(30)16-3-1-2-4-17(16)27-13-14-7-8-25-20(11-14)26-9-10-29/h1-8,11-12,27,29H,9-10,13H2,(H,25,26)(H,28,30)
NCI pathway
Reactome pathway
n/an/a 112n/an/an/an/an/an/a
Bayer Research Center
Curated by ChEMBL
Assay Description
Inhibition of b-Raf
Bioorg Med Chem Lett 17: 4378-81 (2007)
Article DOI: 10.1016/j.bmcl.2007.02.075
BindingDB Entry DOI: 10.7270/Q28K78S7