BDBM50215797 2-((2-cyanopyridin-4-yl)methylamino)-N-(2,2-difluorobenzo[d][1,3]dioxol-5-yl)benzamide::CHEMBL248257
SMILES: FC1(F)Oc2ccc(NC(=O)c3ccccc3NCc3ccnc(c3)C#N)cc2O1
InChI Key: InChIKey=MBVMUJLUEAVVFH-UHFFFAOYSA-N
Data: 2 IC50
Activity Spreadsheet -- Enzyme Inhibition Constant Data from BindingDB
Found 2 hits for monomerid = 50215797
Trg + Lig
Ki
nM
ΔG°
kcal/mole
IC50
nM
Kd
nM
EC50/IC50
nM
koff
s-1
kon
M-1s-1
pHTemp
°C
Serine/threonine-protein kinase B-raf
(Homo sapiens (Human))
BDBM50215797
(2-((2-cyanopyridin-4-yl)methylamino)-N-(2,2-difluo...)
Show SMILES FC1(F)Oc2ccc(NC(=O)c3ccccc3NCc3ccnc(c3)C#N)cc2O1
Show InChI InChI=1S/C21H14F2N4O3/c22-21(23)29-18-6-5-14(10-19(18)30-21)27-20(28)16-3-1-2-4-17(16)26-12-13-7-8-25-15(9-13)11-24/h1-10,26H,12H2,(H,27,28)
NCI pathway
Reactome pathway
n/an/a 110n/an/an/an/an/an/a
Bayer Research Center
Curated by ChEMBL
Assay Description
Inhibition of b-Raf
Bioorg Med Chem Lett 17: 4378-81 (2007)
Article DOI: 10.1016/j.bmcl.2007.02.075
BindingDB Entry DOI: 10.7270/Q28K78S7
Mast/stem cell growth factor receptor Kit
(Homo sapiens (Human))
BDBM50215797
(2-((2-cyanopyridin-4-yl)methylamino)-N-(2,2-difluo...)
Show SMILES FC1(F)Oc2ccc(NC(=O)c3ccccc3NCc3ccnc(c3)C#N)cc2O1
Show InChI InChI=1S/C21H14F2N4O3/c22-21(23)29-18-6-5-14(10-19(18)30-21)27-20(28)16-3-1-2-4-17(16)26-12-13-7-8-25-15(9-13)11-24/h1-10,26H,12H2,(H,27,28)
n/an/a 37n/an/an/an/an/an/a
Bayer Research Center
Curated by ChEMBL
Assay Description
Inhibition of human recombinant cKit by FRET assay
Bioorg Med Chem Lett 17: 4378-81 (2007)
Article DOI: 10.1016/j.bmcl.2007.02.075
BindingDB Entry DOI: 10.7270/Q28K78S7