BDBM50223980 3-(benzyl-phenyl-carbamoyloxy)-8,8-dimethyl-8-azonia-bicyclo[3.2.1]octane; bromide::CHEMBL237092
SMILES: C[N+]1(C)C2CCC1CC(C2)OC(=O)N(Cc1ccccc1)c1ccccc1
InChI Key: InChIKey=GNQCCPIYKSBVEZ-UHFFFAOYSA-N
Data: 3 IC50
Activity Spreadsheet -- Enzyme Inhibition Constant Data from BindingDB
Found 3 hits for monomerid = 50223980
Trg + Lig
Ki
nM
ΔG°
kcal/mole
IC50
nM
Kd
nM
EC50/IC50
nM
koff
s-1
kon
M-1s-1
pHTemp
°C
Muscarinic acetylcholine receptor M2
(Homo sapiens (Human))
BDBM50223980
(3-(benzyl-phenyl-carbamoyloxy)-8,8-dimethyl-8-azon...)
Show SMILES C[N+]1(C)C2CCC1CC(C2)OC(=O)N(Cc1ccccc1)c1ccccc1 |w:6.7,3.3,THB:10:8:1:4.5|
Show InChI InChI=1S/C23H29N2O2/c1-25(2)20-13-14-21(25)16-22(15-20)27-23(26)24(19-11-7-4-8-12-19)17-18-9-5-3-6-10-18/h3-12,20-22H,13-17H2,1-2H3/q+1
n/an/a 48n/an/an/an/an/an/a
GlaxoSmithkline
Curated by ChEMBL
Assay Description
Antagonist activity at cloned muscarinic M2 receptor expressed in CHO cells by measuring calcium mobilization
Bioorg Med Chem Lett 17: 6066-9 (2007)
Article DOI: 10.1016/j.bmcl.2007.09.071
BindingDB Entry DOI: 10.7270/Q2BC3Z8T
Muscarinic acetylcholine receptor M3
(Homo sapiens (Human))
BDBM50223980
(3-(benzyl-phenyl-carbamoyloxy)-8,8-dimethyl-8-azon...)
Show SMILES C[N+]1(C)C2CCC1CC(C2)OC(=O)N(Cc1ccccc1)c1ccccc1 |w:6.7,3.3,THB:10:8:1:4.5|
Show InChI InChI=1S/C23H29N2O2/c1-25(2)20-13-14-21(25)16-22(15-20)27-23(26)24(19-11-7-4-8-12-19)17-18-9-5-3-6-10-18/h3-12,20-22H,13-17H2,1-2H3/q+1
Reactome pathway
n/an/a 4.60n/an/an/an/an/an/a
GlaxoSmithkline
Curated by ChEMBL
Assay Description
Antagonist activity at cloned muscarinic M3 receptor expressed in CHO cells by measuring calcium mobilization
Bioorg Med Chem Lett 17: 6066-9 (2007)
Article DOI: 10.1016/j.bmcl.2007.09.071
BindingDB Entry DOI: 10.7270/Q2BC3Z8T
Muscarinic acetylcholine receptor M1
(Homo sapiens (Human))
BDBM50223980
(3-(benzyl-phenyl-carbamoyloxy)-8,8-dimethyl-8-azon...)
Show SMILES C[N+]1(C)C2CCC1CC(C2)OC(=O)N(Cc1ccccc1)c1ccccc1 |w:6.7,3.3,THB:10:8:1:4.5|
Show InChI InChI=1S/C23H29N2O2/c1-25(2)20-13-14-21(25)16-22(15-20)27-23(26)24(19-11-7-4-8-12-19)17-18-9-5-3-6-10-18/h3-12,20-22H,13-17H2,1-2H3/q+1
n/an/a 4.5n/an/an/an/an/an/a
GlaxoSmithkline
Curated by ChEMBL
Assay Description
Antagonist activity at cloned muscarinic M1 receptor expressed in CHO cells by measuring calcium mobilization
Bioorg Med Chem Lett 17: 6066-9 (2007)
Article DOI: 10.1016/j.bmcl.2007.09.071
BindingDB Entry DOI: 10.7270/Q2BC3Z8T