BDBM50223987 8,8-dimethyl-3-[(3-methyl-furan-2-ylmethyl)-phenyl-carbamoyloxy]-8-azonia-bicyclo[3.2.1]octane; bromide::CHEMBL398591
SMILES: Cc1ccoc1CN(C(=O)OC1CC2CCC(C1)[N+]2(C)C)c1ccccc1
InChI Key: InChIKey=FPBBKOFNQVUXDJ-UHFFFAOYSA-N
Data: 3 IC50
Activity Spreadsheet -- Enzyme Inhibition Constant Data from BindingDB
Found 3 hits for monomerid = 50223987
Trg + Lig
Ki
nM
ΔG°
kcal/mole
IC50
nM
Kd
nM
EC50/IC50
nM
koff
s-1
kon
M-1s-1
pHTemp
°C
Muscarinic acetylcholine receptor M3
(Homo sapiens (Human))
BDBM50223987
(8,8-dimethyl-3-[(3-methyl-furan-2-ylmethyl)-phenyl...)
Show SMILES Cc1ccoc1CN(C(=O)OC1CC2CCC(C1)[N+]2(C)C)c1ccccc1 |w:16.17,13.14,TLB:10:11:18:14.15|
Show InChI InChI=1S/C22H29N2O3/c1-16-11-12-26-21(16)15-23(17-7-5-4-6-8-17)22(25)27-20-13-18-9-10-19(14-20)24(18,2)3/h4-8,11-12,18-20H,9-10,13-15H2,1-3H3/q+1
Reactome pathway
n/an/a 42.3n/an/an/an/an/an/a
GlaxoSmithkline
Curated by ChEMBL
Assay Description
Antagonist activity at cloned muscarinic M3 receptor expressed in CHO cells by measuring calcium mobilization
Bioorg Med Chem Lett 17: 6066-9 (2007)
Article DOI: 10.1016/j.bmcl.2007.09.071
BindingDB Entry DOI: 10.7270/Q2BC3Z8T
Muscarinic acetylcholine receptor M2
(Homo sapiens (Human))
BDBM50223987
(8,8-dimethyl-3-[(3-methyl-furan-2-ylmethyl)-phenyl...)
Show SMILES Cc1ccoc1CN(C(=O)OC1CC2CCC(C1)[N+]2(C)C)c1ccccc1 |w:16.17,13.14,TLB:10:11:18:14.15|
Show InChI InChI=1S/C22H29N2O3/c1-16-11-12-26-21(16)15-23(17-7-5-4-6-8-17)22(25)27-20-13-18-9-10-19(14-20)24(18,2)3/h4-8,11-12,18-20H,9-10,13-15H2,1-3H3/q+1
n/an/a 229n/an/an/an/an/an/a
GlaxoSmithkline
Curated by ChEMBL
Assay Description
Antagonist activity at cloned muscarinic M2 receptor expressed in CHO cells by measuring calcium mobilization
Bioorg Med Chem Lett 17: 6066-9 (2007)
Article DOI: 10.1016/j.bmcl.2007.09.071
BindingDB Entry DOI: 10.7270/Q2BC3Z8T
Muscarinic acetylcholine receptor M1
(Homo sapiens (Human))
BDBM50223987
(8,8-dimethyl-3-[(3-methyl-furan-2-ylmethyl)-phenyl...)
Show SMILES Cc1ccoc1CN(C(=O)OC1CC2CCC(C1)[N+]2(C)C)c1ccccc1 |w:16.17,13.14,TLB:10:11:18:14.15|
Show InChI InChI=1S/C22H29N2O3/c1-16-11-12-26-21(16)15-23(17-7-5-4-6-8-17)22(25)27-20-13-18-9-10-19(14-20)24(18,2)3/h4-8,11-12,18-20H,9-10,13-15H2,1-3H3/q+1
n/an/a 15.2n/an/an/an/an/an/a
GlaxoSmithkline
Curated by ChEMBL
Assay Description
Antagonist activity at cloned muscarinic M1 receptor expressed in CHO cells by measuring calcium mobilization
Bioorg Med Chem Lett 17: 6066-9 (2007)
Article DOI: 10.1016/j.bmcl.2007.09.071
BindingDB Entry DOI: 10.7270/Q2BC3Z8T