BDBM50232596 CHEMBL4064914
SMILES: C1N=C(Nc2ccncn2)OC11CN2CCC1CC2
InChI Key: InChIKey=GGGRBSQPJNGKRM-UHFFFAOYSA-N
Data: 1 IC50  4 EC50
Activity Spreadsheet -- Enzyme Inhibition Constant Data from BindingDB
Found 5 hits for monomerid = 50232596
Trg + Lig
Ki
nM
ΔG°
kcal/mole
IC50
nM
Kd
nM
EC50/IC50
nM
koff
s-1
kon
M-1s-1
pHTemp
°C
Nicotinic acetylcholine receptor alpha-1/beta-1/delta/epsilon
(Homo sapiens (Human))
BDBM50232596
(CHEMBL4064914)
Show SMILES C1N=C(Nc2ccncn2)OC11CN2CCC1CC2 |t:1,TLB:10:11:15.14:17.18,THB:0:11:15.14:17.18,(5.42,-16.68,;6.57,-15.65,;5.95,-14.24,;6.72,-12.9,;8.26,-12.91,;9.02,-11.57,;10.56,-11.57,;11.33,-12.91,;10.57,-14.24,;9.03,-14.24,;4.41,-14.4,;4.09,-15.9,;4.08,-17.32,;1.91,-16.78,;1.92,-14.98,;2.49,-13.7,;2.56,-15.23,;1.16,-15.99,;.84,-17.55,)|
Show InChI InChI=1S/C13H17N5O/c1-4-14-9-16-11(1)17-12-15-7-13(19-12)8-18-5-2-10(13)3-6-18/h1,4,9-10H,2-3,5-8H2,(H,14,15,16,17)
NCI pathway
Reactome pathway
n/an/an/an/a>1.00E+5n/an/an/an/a
Bristol-Myers Squibb Pharmaceutical Research Institute
Curated by ChEMBL
Assay Description
Agonist activity at alpha1beta1deltaepsilon nAChR (unknown origin) assessed as increase in calcium influx measured for 2 mins by Fluo-4-AM dye based ...
Bioorg Med Chem Lett 27: 1261-1266 (2017)
BindingDB Entry DOI: 10.7270/Q2FJ2K1D
Neuronal acetylcholine receptor Alpha-4/Beta-2
(Homo sapiens (Human))
BDBM50232596
(CHEMBL4064914)
Show SMILES C1N=C(Nc2ccncn2)OC11CN2CCC1CC2 |t:1,TLB:10:11:15.14:17.18,THB:0:11:15.14:17.18,(5.42,-16.68,;6.57,-15.65,;5.95,-14.24,;6.72,-12.9,;8.26,-12.91,;9.02,-11.57,;10.56,-11.57,;11.33,-12.91,;10.57,-14.24,;9.03,-14.24,;4.41,-14.4,;4.09,-15.9,;4.08,-17.32,;1.91,-16.78,;1.92,-14.98,;2.49,-13.7,;2.56,-15.23,;1.16,-15.99,;.84,-17.55,)|
Show InChI InChI=1S/C13H17N5O/c1-4-14-9-16-11(1)17-12-15-7-13(19-12)8-18-5-2-10(13)3-6-18/h1,4,9-10H,2-3,5-8H2,(H,14,15,16,17)
NCI pathway
Reactome pathway
n/an/an/an/a>1.00E+5n/an/an/an/a
Bristol-Myers Squibb Pharmaceutical Research Institute
Curated by ChEMBL
Assay Description
Agonist activity at alpha4beta2 nAChR (unknown origin) assessed as increase in calcium influx measured for 2 mins by Fluo-4-AM dye based FLIPR assay
Bioorg Med Chem Lett 27: 1261-1266 (2017)
BindingDB Entry DOI: 10.7270/Q2FJ2K1D
Neuronal acetylcholine receptor
(Rattus norvegicus (Rat))
BDBM50232596
(CHEMBL4064914)
Show SMILES C1N=C(Nc2ccncn2)OC11CN2CCC1CC2 |t:1,TLB:10:11:15.14:17.18,THB:0:11:15.14:17.18,(5.42,-16.68,;6.57,-15.65,;5.95,-14.24,;6.72,-12.9,;8.26,-12.91,;9.02,-11.57,;10.56,-11.57,;11.33,-12.91,;10.57,-14.24,;9.03,-14.24,;4.41,-14.4,;4.09,-15.9,;4.08,-17.32,;1.91,-16.78,;1.92,-14.98,;2.49,-13.7,;2.56,-15.23,;1.16,-15.99,;.84,-17.55,)|
Show InChI InChI=1S/C13H17N5O/c1-4-14-9-16-11(1)17-12-15-7-13(19-12)8-18-5-2-10(13)3-6-18/h1,4,9-10H,2-3,5-8H2,(H,14,15,16,17)
Reactome pathway
n/an/an/an/a 840n/an/an/an/a
Bristol-Myers Squibb Pharmaceutical Research Institute
Curated by ChEMBL
Assay Description
Agonist activity at rat alpha7 nAChR expressed in HEK293 cells assessed as increase in calcium influx measured for 2 mins by Fluo-4-AM dye based FLIP...
Bioorg Med Chem Lett 27: 1261-1266 (2017)
BindingDB Entry DOI: 10.7270/Q2FJ2K1D
5-hydroxytryptamine receptor 3A
(Homo sapiens (Human))
BDBM50232596
(CHEMBL4064914)
Show SMILES C1N=C(Nc2ccncn2)OC11CN2CCC1CC2 |t:1,TLB:10:11:15.14:17.18,THB:0:11:15.14:17.18,(5.42,-16.68,;6.57,-15.65,;5.95,-14.24,;6.72,-12.9,;8.26,-12.91,;9.02,-11.57,;10.56,-11.57,;11.33,-12.91,;10.57,-14.24,;9.03,-14.24,;4.41,-14.4,;4.09,-15.9,;4.08,-17.32,;1.91,-16.78,;1.92,-14.98,;2.49,-13.7,;2.56,-15.23,;1.16,-15.99,;.84,-17.55,)|
Show InChI InChI=1S/C13H17N5O/c1-4-14-9-16-11(1)17-12-15-7-13(19-12)8-18-5-2-10(13)3-6-18/h1,4,9-10H,2-3,5-8H2,(H,14,15,16,17)
Reactome pathway
n/an/a 440n/an/an/an/an/an/a
Bristol-Myers Squibb Pharmaceutical Research Institute
Curated by ChEMBL
Assay Description
Antagonist activity at human 5HT3A receptor assessed as inhibition of 5-HT-induced calcium influx by Fluo-4-AM dye based FLIPR assay
Bioorg Med Chem Lett 27: 1261-1266 (2017)
BindingDB Entry DOI: 10.7270/Q2FJ2K1D
Neuronal acetylcholine receptor; alpha3/beta4
(Homo sapiens (Human))
BDBM50232596
(CHEMBL4064914)
Show SMILES C1N=C(Nc2ccncn2)OC11CN2CCC1CC2 |t:1,TLB:10:11:15.14:17.18,THB:0:11:15.14:17.18,(5.42,-16.68,;6.57,-15.65,;5.95,-14.24,;6.72,-12.9,;8.26,-12.91,;9.02,-11.57,;10.56,-11.57,;11.33,-12.91,;10.57,-14.24,;9.03,-14.24,;4.41,-14.4,;4.09,-15.9,;4.08,-17.32,;1.91,-16.78,;1.92,-14.98,;2.49,-13.7,;2.56,-15.23,;1.16,-15.99,;.84,-17.55,)|
Show InChI InChI=1S/C13H17N5O/c1-4-14-9-16-11(1)17-12-15-7-13(19-12)8-18-5-2-10(13)3-6-18/h1,4,9-10H,2-3,5-8H2,(H,14,15,16,17)
n/an/an/an/a>1.00E+5n/an/an/an/a
Bristol-Myers Squibb Pharmaceutical Research Institute
Curated by ChEMBL
Assay Description
Agonist activity at alpha3beta4 nAChR (unknown origin) assessed as increase in calcium influx measured for 2 mins by Fluo-4-AM dye based FLIPR assay
Bioorg Med Chem Lett 27: 1261-1266 (2017)
BindingDB Entry DOI: 10.7270/Q2FJ2K1D