BDBM50232598 CHEMBL4084852
SMILES: Cc1ccnc(NC2=NC[C@@]3(CN4CCC3CC4)O2)n1
InChI Key: InChIKey=MMVNBNVFIIGGPC-AWEZNQCLSA-N
Data: 1 IC50  4 EC50
Activity Spreadsheet -- Enzyme Inhibition Constant Data from BindingDB
Found 5 hits for monomerid = 50232598
Trg + Lig
Ki
nM
ΔG°
kcal/mole
IC50
nM
Kd
nM
EC50/IC50
nM
koff
s-1
kon
M-1s-1
pHTemp
°C
Neuronal acetylcholine receptor Alpha-4/Beta-2
(Homo sapiens (Human))
BDBM50232598
(CHEMBL4084852)
Show SMILES Cc1ccnc(NC2=NC[C@@]3(CN4CCC3CC4)O2)n1 |r,wU:10.19,t:7,TLB:18:10:14.13:16.17,THB:9:10:14.13:16.17,(45.92,-10.63,;45.15,-11.97,;45.92,-13.31,;45.15,-14.64,;43.61,-14.64,;42.85,-13.3,;41.31,-13.3,;40.53,-14.64,;41.16,-16.04,;40.01,-17.07,;38.68,-16.3,;38.67,-17.71,;36.5,-17.18,;36.51,-15.38,;37.08,-14.1,;37.15,-15.63,;35.76,-16.39,;35.43,-17.94,;39,-14.8,;43.61,-11.97,)|
Show InChI InChI=1S/C14H19N5O/c1-10-2-5-15-12(17-10)18-13-16-8-14(20-13)9-19-6-3-11(14)4-7-19/h2,5,11H,3-4,6-9H2,1H3,(H,15,16,17,18)/t14-/m0/s1
NCI pathway
Reactome pathway
n/an/an/an/a>1.00E+5n/an/an/an/a
Bristol-Myers Squibb Pharmaceutical Research Institute
Curated by ChEMBL
Assay Description
Agonist activity at alpha4beta2 nAChR (unknown origin) assessed as increase in calcium influx measured for 2 mins by Fluo-4-AM dye based FLIPR assay
Bioorg Med Chem Lett 27: 1261-1266 (2017)
BindingDB Entry DOI: 10.7270/Q2FJ2K1D
Neuronal acetylcholine receptor; alpha3/beta4
(Homo sapiens (Human))
BDBM50232598
(CHEMBL4084852)
Show SMILES Cc1ccnc(NC2=NC[C@@]3(CN4CCC3CC4)O2)n1 |r,wU:10.19,t:7,TLB:18:10:14.13:16.17,THB:9:10:14.13:16.17,(45.92,-10.63,;45.15,-11.97,;45.92,-13.31,;45.15,-14.64,;43.61,-14.64,;42.85,-13.3,;41.31,-13.3,;40.53,-14.64,;41.16,-16.04,;40.01,-17.07,;38.68,-16.3,;38.67,-17.71,;36.5,-17.18,;36.51,-15.38,;37.08,-14.1,;37.15,-15.63,;35.76,-16.39,;35.43,-17.94,;39,-14.8,;43.61,-11.97,)|
Show InChI InChI=1S/C14H19N5O/c1-10-2-5-15-12(17-10)18-13-16-8-14(20-13)9-19-6-3-11(14)4-7-19/h2,5,11H,3-4,6-9H2,1H3,(H,15,16,17,18)/t14-/m0/s1
n/an/an/an/a>1.00E+5n/an/an/an/a
Bristol-Myers Squibb Pharmaceutical Research Institute
Curated by ChEMBL
Assay Description
Agonist activity at alpha3beta4 nAChR (unknown origin) assessed as increase in calcium influx measured for 2 mins by Fluo-4-AM dye based FLIPR assay
Bioorg Med Chem Lett 27: 1261-1266 (2017)
BindingDB Entry DOI: 10.7270/Q2FJ2K1D
Neuronal acetylcholine receptor
(Rattus norvegicus (Rat))
BDBM50232598
(CHEMBL4084852)
Show SMILES Cc1ccnc(NC2=NC[C@@]3(CN4CCC3CC4)O2)n1 |r,wU:10.19,t:7,TLB:18:10:14.13:16.17,THB:9:10:14.13:16.17,(45.92,-10.63,;45.15,-11.97,;45.92,-13.31,;45.15,-14.64,;43.61,-14.64,;42.85,-13.3,;41.31,-13.3,;40.53,-14.64,;41.16,-16.04,;40.01,-17.07,;38.68,-16.3,;38.67,-17.71,;36.5,-17.18,;36.51,-15.38,;37.08,-14.1,;37.15,-15.63,;35.76,-16.39,;35.43,-17.94,;39,-14.8,;43.61,-11.97,)|
Show InChI InChI=1S/C14H19N5O/c1-10-2-5-15-12(17-10)18-13-16-8-14(20-13)9-19-6-3-11(14)4-7-19/h2,5,11H,3-4,6-9H2,1H3,(H,15,16,17,18)/t14-/m0/s1
Reactome pathway
n/an/an/an/a 120n/an/an/an/a
Bristol-Myers Squibb Pharmaceutical Research Institute
Curated by ChEMBL
Assay Description
Agonist activity at rat alpha7 nAChR expressed in HEK293 cells assessed as increase in calcium influx measured for 2 mins by Fluo-4-AM dye based FLIP...
Bioorg Med Chem Lett 27: 1261-1266 (2017)
BindingDB Entry DOI: 10.7270/Q2FJ2K1D
5-hydroxytryptamine receptor 3A
(Homo sapiens (Human))
BDBM50232598
(CHEMBL4084852)
Show SMILES Cc1ccnc(NC2=NC[C@@]3(CN4CCC3CC4)O2)n1 |r,wU:10.19,t:7,TLB:18:10:14.13:16.17,THB:9:10:14.13:16.17,(45.92,-10.63,;45.15,-11.97,;45.92,-13.31,;45.15,-14.64,;43.61,-14.64,;42.85,-13.3,;41.31,-13.3,;40.53,-14.64,;41.16,-16.04,;40.01,-17.07,;38.68,-16.3,;38.67,-17.71,;36.5,-17.18,;36.51,-15.38,;37.08,-14.1,;37.15,-15.63,;35.76,-16.39,;35.43,-17.94,;39,-14.8,;43.61,-11.97,)|
Show InChI InChI=1S/C14H19N5O/c1-10-2-5-15-12(17-10)18-13-16-8-14(20-13)9-19-6-3-11(14)4-7-19/h2,5,11H,3-4,6-9H2,1H3,(H,15,16,17,18)/t14-/m0/s1
Reactome pathway
n/an/a 25n/an/an/an/an/an/a
Bristol-Myers Squibb Pharmaceutical Research Institute
Curated by ChEMBL
Assay Description
Antagonist activity at human 5HT3A receptor assessed as inhibition of 5-HT-induced calcium influx by Fluo-4-AM dye based FLIPR assay
Bioorg Med Chem Lett 27: 1261-1266 (2017)
BindingDB Entry DOI: 10.7270/Q2FJ2K1D
Nicotinic acetylcholine receptor alpha-1/beta-1/delta/epsilon
(Homo sapiens (Human))
BDBM50232598
(CHEMBL4084852)
Show SMILES Cc1ccnc(NC2=NC[C@@]3(CN4CCC3CC4)O2)n1 |r,wU:10.19,t:7,TLB:18:10:14.13:16.17,THB:9:10:14.13:16.17,(45.92,-10.63,;45.15,-11.97,;45.92,-13.31,;45.15,-14.64,;43.61,-14.64,;42.85,-13.3,;41.31,-13.3,;40.53,-14.64,;41.16,-16.04,;40.01,-17.07,;38.68,-16.3,;38.67,-17.71,;36.5,-17.18,;36.51,-15.38,;37.08,-14.1,;37.15,-15.63,;35.76,-16.39,;35.43,-17.94,;39,-14.8,;43.61,-11.97,)|
Show InChI InChI=1S/C14H19N5O/c1-10-2-5-15-12(17-10)18-13-16-8-14(20-13)9-19-6-3-11(14)4-7-19/h2,5,11H,3-4,6-9H2,1H3,(H,15,16,17,18)/t14-/m0/s1
NCI pathway
Reactome pathway
n/an/an/an/a>1.00E+5n/an/an/an/a
Bristol-Myers Squibb Pharmaceutical Research Institute
Curated by ChEMBL
Assay Description
Agonist activity at alpha1beta1deltaepsilon nAChR (unknown origin) assessed as increase in calcium influx measured for 2 mins by Fluo-4-AM dye based ...
Bioorg Med Chem Lett 27: 1261-1266 (2017)
BindingDB Entry DOI: 10.7270/Q2FJ2K1D