BDBM50232606 CHEMBL4083246
SMILES: Cc1cncc(NC2=NC[C@@]3(CN4CCC3CC4)O2)n1
InChI Key: InChIKey=WOFBWIHYCXPNDB-AWEZNQCLSA-N
Data: 1 IC50  4 EC50
Activity Spreadsheet -- Enzyme Inhibition Constant Data from BindingDB
Found 5 hits for monomerid = 50232606
Trg + Lig
Ki
nM
ΔG°
kcal/mole
IC50
nM
Kd
nM
EC50/IC50
nM
koff
s-1
kon
M-1s-1
pHTemp
°C
Neuronal acetylcholine receptor Alpha-4/Beta-2
(Homo sapiens (Human))
BDBM50232606
(CHEMBL4083246)
Show SMILES Cc1cncc(NC2=NC[C@@]3(CN4CCC3CC4)O2)n1 |r,wU:10.19,t:7,TLB:18:10:14.13:16.17,THB:9:10:14.13:16.17,(34.42,-36.17,;33.64,-34.83,;34.41,-33.5,;33.64,-32.16,;32.1,-32.16,;31.34,-33.49,;29.79,-33.49,;29.02,-34.83,;29.65,-36.24,;28.5,-37.27,;27.17,-36.49,;27.15,-37.91,;24.99,-37.37,;25,-35.57,;25.56,-34.29,;25.64,-35.82,;24.24,-36.58,;23.92,-38.14,;27.49,-34.99,;32.1,-34.83,)|
Show InChI InChI=1S/C14H19N5O/c1-10-6-15-7-12(17-10)18-13-16-8-14(20-13)9-19-4-2-11(14)3-5-19/h6-7,11H,2-5,8-9H2,1H3,(H,16,17,18)/t14-/m0/s1
NCI pathway
Reactome pathway
n/an/an/an/a>1.00E+5n/an/an/an/a
Bristol-Myers Squibb Pharmaceutical Research Institute
Curated by ChEMBL
Assay Description
Agonist activity at alpha4beta2 nAChR (unknown origin) assessed as increase in calcium influx measured for 2 mins by Fluo-4-AM dye based FLIPR assay
Bioorg Med Chem Lett 27: 1261-1266 (2017)
BindingDB Entry DOI: 10.7270/Q2FJ2K1D
Nicotinic acetylcholine receptor alpha-1/beta-1/delta/epsilon
(Homo sapiens (Human))
BDBM50232606
(CHEMBL4083246)
Show SMILES Cc1cncc(NC2=NC[C@@]3(CN4CCC3CC4)O2)n1 |r,wU:10.19,t:7,TLB:18:10:14.13:16.17,THB:9:10:14.13:16.17,(34.42,-36.17,;33.64,-34.83,;34.41,-33.5,;33.64,-32.16,;32.1,-32.16,;31.34,-33.49,;29.79,-33.49,;29.02,-34.83,;29.65,-36.24,;28.5,-37.27,;27.17,-36.49,;27.15,-37.91,;24.99,-37.37,;25,-35.57,;25.56,-34.29,;25.64,-35.82,;24.24,-36.58,;23.92,-38.14,;27.49,-34.99,;32.1,-34.83,)|
Show InChI InChI=1S/C14H19N5O/c1-10-6-15-7-12(17-10)18-13-16-8-14(20-13)9-19-4-2-11(14)3-5-19/h6-7,11H,2-5,8-9H2,1H3,(H,16,17,18)/t14-/m0/s1
NCI pathway
Reactome pathway
n/an/an/an/a>1.00E+5n/an/an/an/a
Bristol-Myers Squibb Pharmaceutical Research Institute
Curated by ChEMBL
Assay Description
Agonist activity at alpha1beta1deltaepsilon nAChR (unknown origin) assessed as increase in calcium influx measured for 2 mins by Fluo-4-AM dye based ...
Bioorg Med Chem Lett 27: 1261-1266 (2017)
BindingDB Entry DOI: 10.7270/Q2FJ2K1D
5-hydroxytryptamine receptor 3A
(Homo sapiens (Human))
BDBM50232606
(CHEMBL4083246)
Show SMILES Cc1cncc(NC2=NC[C@@]3(CN4CCC3CC4)O2)n1 |r,wU:10.19,t:7,TLB:18:10:14.13:16.17,THB:9:10:14.13:16.17,(34.42,-36.17,;33.64,-34.83,;34.41,-33.5,;33.64,-32.16,;32.1,-32.16,;31.34,-33.49,;29.79,-33.49,;29.02,-34.83,;29.65,-36.24,;28.5,-37.27,;27.17,-36.49,;27.15,-37.91,;24.99,-37.37,;25,-35.57,;25.56,-34.29,;25.64,-35.82,;24.24,-36.58,;23.92,-38.14,;27.49,-34.99,;32.1,-34.83,)|
Show InChI InChI=1S/C14H19N5O/c1-10-6-15-7-12(17-10)18-13-16-8-14(20-13)9-19-4-2-11(14)3-5-19/h6-7,11H,2-5,8-9H2,1H3,(H,16,17,18)/t14-/m0/s1
Reactome pathway
n/an/a 29n/an/an/an/an/an/a
Bristol-Myers Squibb Pharmaceutical Research Institute
Curated by ChEMBL
Assay Description
Antagonist activity at human 5HT3A receptor assessed as inhibition of 5-HT-induced calcium influx by Fluo-4-AM dye based FLIPR assay
Bioorg Med Chem Lett 27: 1261-1266 (2017)
BindingDB Entry DOI: 10.7270/Q2FJ2K1D
Neuronal acetylcholine receptor
(Rattus norvegicus (Rat))
BDBM50232606
(CHEMBL4083246)
Show SMILES Cc1cncc(NC2=NC[C@@]3(CN4CCC3CC4)O2)n1 |r,wU:10.19,t:7,TLB:18:10:14.13:16.17,THB:9:10:14.13:16.17,(34.42,-36.17,;33.64,-34.83,;34.41,-33.5,;33.64,-32.16,;32.1,-32.16,;31.34,-33.49,;29.79,-33.49,;29.02,-34.83,;29.65,-36.24,;28.5,-37.27,;27.17,-36.49,;27.15,-37.91,;24.99,-37.37,;25,-35.57,;25.56,-34.29,;25.64,-35.82,;24.24,-36.58,;23.92,-38.14,;27.49,-34.99,;32.1,-34.83,)|
Show InChI InChI=1S/C14H19N5O/c1-10-6-15-7-12(17-10)18-13-16-8-14(20-13)9-19-4-2-11(14)3-5-19/h6-7,11H,2-5,8-9H2,1H3,(H,16,17,18)/t14-/m0/s1
Reactome pathway
n/an/an/an/a 1.60E+3n/an/an/an/a
Bristol-Myers Squibb Pharmaceutical Research Institute
Curated by ChEMBL
Assay Description
Agonist activity at rat alpha7 nAChR expressed in HEK293 cells assessed as increase in calcium influx measured for 2 mins by Fluo-4-AM dye based FLIP...
Bioorg Med Chem Lett 27: 1261-1266 (2017)
BindingDB Entry DOI: 10.7270/Q2FJ2K1D
Neuronal acetylcholine receptor; alpha3/beta4
(Homo sapiens (Human))
BDBM50232606
(CHEMBL4083246)
Show SMILES Cc1cncc(NC2=NC[C@@]3(CN4CCC3CC4)O2)n1 |r,wU:10.19,t:7,TLB:18:10:14.13:16.17,THB:9:10:14.13:16.17,(34.42,-36.17,;33.64,-34.83,;34.41,-33.5,;33.64,-32.16,;32.1,-32.16,;31.34,-33.49,;29.79,-33.49,;29.02,-34.83,;29.65,-36.24,;28.5,-37.27,;27.17,-36.49,;27.15,-37.91,;24.99,-37.37,;25,-35.57,;25.56,-34.29,;25.64,-35.82,;24.24,-36.58,;23.92,-38.14,;27.49,-34.99,;32.1,-34.83,)|
Show InChI InChI=1S/C14H19N5O/c1-10-6-15-7-12(17-10)18-13-16-8-14(20-13)9-19-4-2-11(14)3-5-19/h6-7,11H,2-5,8-9H2,1H3,(H,16,17,18)/t14-/m0/s1
n/an/an/an/a>1.00E+5n/an/an/an/a
Bristol-Myers Squibb Pharmaceutical Research Institute
Curated by ChEMBL
Assay Description
Agonist activity at alpha3beta4 nAChR (unknown origin) assessed as increase in calcium influx measured for 2 mins by Fluo-4-AM dye based FLIPR assay
Bioorg Med Chem Lett 27: 1261-1266 (2017)
BindingDB Entry DOI: 10.7270/Q2FJ2K1D