BDBM50232617 CHEMBL4066807
SMILES: CC(C)c1cc(NC2=NC[C@@]3(CN4CCC3CC4)O2)ncn1
InChI Key: InChIKey=QGZOVUOHCCMRQN-INIZCTEOSA-N
Data: 1 IC50  4 EC50
Activity Spreadsheet -- Enzyme Inhibition Constant Data from BindingDB
Found 5 hits for monomerid = 50232617
Trg + Lig
Ki
nM
ΔG°
kcal/mole
IC50
nM
Kd
nM
EC50/IC50
nM
koff
s-1
kon
M-1s-1
pHTemp
°C
Neuronal acetylcholine receptor Alpha-4/Beta-2
(Homo sapiens (Human))
BDBM50232617
(CHEMBL4066807)
Show SMILES CC(C)c1cc(NC2=NC[C@@]3(CN4CCC3CC4)O2)ncn1 |r,wU:10.19,t:7,TLB:18:10:14.13:16.17,THB:9:10:14.13:16.17,(36.22,-40.4,;34.68,-40.4,;33.91,-39.06,;33.91,-41.73,;32.37,-41.74,;31.61,-43.07,;30.07,-43.07,;29.3,-44.4,;29.92,-45.81,;28.78,-46.84,;27.45,-46.07,;27.43,-47.48,;25.27,-46.95,;25.28,-45.15,;25.84,-43.87,;25.92,-45.4,;24.52,-46.15,;24.2,-47.71,;27.77,-44.56,;32.38,-44.41,;33.92,-44.41,;34.68,-43.07,)|
Show InChI InChI=1S/C16H23N5O/c1-11(2)13-7-14(19-10-18-13)20-15-17-8-16(22-15)9-21-5-3-12(16)4-6-21/h7,10-12H,3-6,8-9H2,1-2H3,(H,17,18,19,20)/t16-/m0/s1
NCI pathway
Reactome pathway
n/an/an/an/a>1.00E+5n/an/an/an/a
Bristol-Myers Squibb Pharmaceutical Research Institute
Curated by ChEMBL
Assay Description
Agonist activity at alpha4beta2 nAChR (unknown origin) assessed as increase in calcium influx measured for 2 mins by Fluo-4-AM dye based FLIPR assay
Bioorg Med Chem Lett 27: 1261-1266 (2017)
BindingDB Entry DOI: 10.7270/Q2FJ2K1D
Neuronal acetylcholine receptor; alpha3/beta4
(Homo sapiens (Human))
BDBM50232617
(CHEMBL4066807)
Show SMILES CC(C)c1cc(NC2=NC[C@@]3(CN4CCC3CC4)O2)ncn1 |r,wU:10.19,t:7,TLB:18:10:14.13:16.17,THB:9:10:14.13:16.17,(36.22,-40.4,;34.68,-40.4,;33.91,-39.06,;33.91,-41.73,;32.37,-41.74,;31.61,-43.07,;30.07,-43.07,;29.3,-44.4,;29.92,-45.81,;28.78,-46.84,;27.45,-46.07,;27.43,-47.48,;25.27,-46.95,;25.28,-45.15,;25.84,-43.87,;25.92,-45.4,;24.52,-46.15,;24.2,-47.71,;27.77,-44.56,;32.38,-44.41,;33.92,-44.41,;34.68,-43.07,)|
Show InChI InChI=1S/C16H23N5O/c1-11(2)13-7-14(19-10-18-13)20-15-17-8-16(22-15)9-21-5-3-12(16)4-6-21/h7,10-12H,3-6,8-9H2,1-2H3,(H,17,18,19,20)/t16-/m0/s1
n/an/an/an/a>1.00E+5n/an/an/an/a
Bristol-Myers Squibb Pharmaceutical Research Institute
Curated by ChEMBL
Assay Description
Agonist activity at alpha3beta4 nAChR (unknown origin) assessed as increase in calcium influx measured for 2 mins by Fluo-4-AM dye based FLIPR assay
Bioorg Med Chem Lett 27: 1261-1266 (2017)
BindingDB Entry DOI: 10.7270/Q2FJ2K1D
Nicotinic acetylcholine receptor alpha-1/beta-1/delta/epsilon
(Homo sapiens (Human))
BDBM50232617
(CHEMBL4066807)
Show SMILES CC(C)c1cc(NC2=NC[C@@]3(CN4CCC3CC4)O2)ncn1 |r,wU:10.19,t:7,TLB:18:10:14.13:16.17,THB:9:10:14.13:16.17,(36.22,-40.4,;34.68,-40.4,;33.91,-39.06,;33.91,-41.73,;32.37,-41.74,;31.61,-43.07,;30.07,-43.07,;29.3,-44.4,;29.92,-45.81,;28.78,-46.84,;27.45,-46.07,;27.43,-47.48,;25.27,-46.95,;25.28,-45.15,;25.84,-43.87,;25.92,-45.4,;24.52,-46.15,;24.2,-47.71,;27.77,-44.56,;32.38,-44.41,;33.92,-44.41,;34.68,-43.07,)|
Show InChI InChI=1S/C16H23N5O/c1-11(2)13-7-14(19-10-18-13)20-15-17-8-16(22-15)9-21-5-3-12(16)4-6-21/h7,10-12H,3-6,8-9H2,1-2H3,(H,17,18,19,20)/t16-/m0/s1
NCI pathway
Reactome pathway
n/an/an/an/a>1.00E+5n/an/an/an/a
Bristol-Myers Squibb Pharmaceutical Research Institute
Curated by ChEMBL
Assay Description
Agonist activity at alpha1beta1deltaepsilon nAChR (unknown origin) assessed as increase in calcium influx measured for 2 mins by Fluo-4-AM dye based ...
Bioorg Med Chem Lett 27: 1261-1266 (2017)
BindingDB Entry DOI: 10.7270/Q2FJ2K1D
Neuronal acetylcholine receptor
(Rattus norvegicus (Rat))
BDBM50232617
(CHEMBL4066807)
Show SMILES CC(C)c1cc(NC2=NC[C@@]3(CN4CCC3CC4)O2)ncn1 |r,wU:10.19,t:7,TLB:18:10:14.13:16.17,THB:9:10:14.13:16.17,(36.22,-40.4,;34.68,-40.4,;33.91,-39.06,;33.91,-41.73,;32.37,-41.74,;31.61,-43.07,;30.07,-43.07,;29.3,-44.4,;29.92,-45.81,;28.78,-46.84,;27.45,-46.07,;27.43,-47.48,;25.27,-46.95,;25.28,-45.15,;25.84,-43.87,;25.92,-45.4,;24.52,-46.15,;24.2,-47.71,;27.77,-44.56,;32.38,-44.41,;33.92,-44.41,;34.68,-43.07,)|
Show InChI InChI=1S/C16H23N5O/c1-11(2)13-7-14(19-10-18-13)20-15-17-8-16(22-15)9-21-5-3-12(16)4-6-21/h7,10-12H,3-6,8-9H2,1-2H3,(H,17,18,19,20)/t16-/m0/s1
Reactome pathway
n/an/an/an/a 440n/an/an/an/a
Bristol-Myers Squibb Pharmaceutical Research Institute
Curated by ChEMBL
Assay Description
Agonist activity at rat alpha7 nAChR expressed in HEK293 cells assessed as increase in calcium influx measured for 2 mins by Fluo-4-AM dye based FLIP...
Bioorg Med Chem Lett 27: 1261-1266 (2017)
BindingDB Entry DOI: 10.7270/Q2FJ2K1D
5-hydroxytryptamine receptor 3A
(Homo sapiens (Human))
BDBM50232617
(CHEMBL4066807)
Show SMILES CC(C)c1cc(NC2=NC[C@@]3(CN4CCC3CC4)O2)ncn1 |r,wU:10.19,t:7,TLB:18:10:14.13:16.17,THB:9:10:14.13:16.17,(36.22,-40.4,;34.68,-40.4,;33.91,-39.06,;33.91,-41.73,;32.37,-41.74,;31.61,-43.07,;30.07,-43.07,;29.3,-44.4,;29.92,-45.81,;28.78,-46.84,;27.45,-46.07,;27.43,-47.48,;25.27,-46.95,;25.28,-45.15,;25.84,-43.87,;25.92,-45.4,;24.52,-46.15,;24.2,-47.71,;27.77,-44.56,;32.38,-44.41,;33.92,-44.41,;34.68,-43.07,)|
Show InChI InChI=1S/C16H23N5O/c1-11(2)13-7-14(19-10-18-13)20-15-17-8-16(22-15)9-21-5-3-12(16)4-6-21/h7,10-12H,3-6,8-9H2,1-2H3,(H,17,18,19,20)/t16-/m0/s1
Reactome pathway
n/an/a>1.00E+4n/an/an/an/an/an/a
Bristol-Myers Squibb Pharmaceutical Research Institute
Curated by ChEMBL
Assay Description
Antagonist activity at human 5HT3A receptor assessed as inhibition of 5-HT-induced calcium influx by Fluo-4-AM dye based FLIPR assay
Bioorg Med Chem Lett 27: 1261-1266 (2017)
BindingDB Entry DOI: 10.7270/Q2FJ2K1D