BDBM50233976 CHEMBL4094056
SMILES: CCCCCCCCCCCCNc1ccnc(NCCN(C)C)n1
InChI Key: InChIKey=WTFJNTNHMJJVIH-UHFFFAOYSA-N
Data: 1 IC50
Activity Spreadsheet -- Enzyme Inhibition Constant Data from BindingDB
Found 1 hit for monomerid = 50233976
Trg + Lig
Ki
nM
ΔG°
kcal/mole
IC50
nM
Kd
nM
EC50/IC50
nM
koff
s-1
kon
M-1s-1
pHTemp
°C
Dynamin-2
(Homo sapiens (Human))
BDBM50233976
(CHEMBL4094056)
Show SMILES CCCCCCCCCCCCNc1ccnc(NCCN(C)C)n1
Show InChI InChI=1S/C20H39N5/c1-4-5-6-7-8-9-10-11-12-13-15-21-19-14-16-22-20(24-19)23-17-18-25(2)3/h14,16H,4-13,15,17-18H2,1-3H3,(H2,21,22,23,24)
NCI pathway
Reactome pathway
n/an/a 6.10E+3n/an/an/an/an/an/a
The University of Newcastle
Curated by ChEMBL
Assay Description
Inhibition of dynamin 2 in human U2OS cells assessed as reduction in clathrin-mediated endocytosis by measuring transferrin-A594 uptake preincubated ...
J Med Chem 60: 349-361 (2017)
BindingDB Entry DOI: 10.7270/Q27M0B6T