BDBM50237211 CHEMBL4061457
SMILES: Cc1ncccc1OCc1cccc2nc(N)nc(N)c12
InChI Key: InChIKey=DQAAUHWZLOHBJA-UHFFFAOYSA-N
Data: 2 IC50
Activity Spreadsheet -- Enzyme Inhibition Constant Data from BindingDB
Found 2 hits for monomerid = 50237211
Trg + Lig
Ki
nM
ΔG°
kcal/mole
IC50
nM
Kd
nM
EC50/IC50
nM
koff
s-1
kon
M-1s-1
pHTemp
°C
Dihydrofolate reductase
(Homo sapiens (Human))
BDBM50237211
(CHEMBL4061457)
Show SMILES Cc1ncccc1OCc1cccc2nc(N)nc(N)c12
Show InChI InChI=1S/C15H15N5O/c1-9-12(6-3-7-18-9)21-8-10-4-2-5-11-13(10)14(16)20-15(17)19-11/h2-7H,8H2,1H3,(H4,16,17,19,20)
NCI pathway
Reactome pathway
n/an/a>1.50E+5n/an/an/an/an/an/a
Pfizer Inc.
Curated by ChEMBL
Assay Description
Inhibition of DHFR (unknown origin)
J Med Chem 60: 3094-3108 (2017)
Article DOI: 10.1021/acs.jmedchem.7b00124
BindingDB Entry DOI: 10.7270/Q2251MG2
Scavenger mRNA-decapping enzyme (DcpS)
(Homo sapiens (Human))
BDBM50237211
(CHEMBL4061457)
Show SMILES Cc1ncccc1OCc1cccc2nc(N)nc(N)c12
Show InChI InChI=1S/C15H15N5O/c1-9-12(6-3-7-18-9)21-8-10-4-2-5-11-13(10)14(16)20-15(17)19-11/h2-7H,8H2,1H3,(H4,16,17,19,20)
Reactome pathway
n/an/a 0.270n/an/an/an/an/an/a
Pfizer Inc.
Curated by ChEMBL
Assay Description
Inhibition of human DcpS assessed as increase in SMN2 promoter activity
J Med Chem 60: 3094-3108 (2017)
Article DOI: 10.1021/acs.jmedchem.7b00124
BindingDB Entry DOI: 10.7270/Q2251MG2