BDBM50238736 CHEMBL1091535::GW7604
SMILES: CCC(=C(c1ccc(O)cc1)c1ccc(\C=C\C(O)=O)cc1)c1ccccc1
InChI Key: InChIKey=SCVIEONTACSLJA-YGCRUXFTSA-N
Data: 1 KI  2 IC50
Activity Spreadsheet -- Enzyme Inhibition Constant Data from BindingDB
Found 3 hits for monomerid = 50238736
Trg + Lig
Ki
nM
ΔG°
kcal/mole
IC50
nM
Kd
nM
EC50/IC50
nM
koff
s-1
kon
M-1s-1
pHTemp
°C
Estrogen receptor
(Homo sapiens (Human))
BDBM50238736
(CHEMBL1091535 | GW7604)
Show SMILES CCC(=C(c1ccc(O)cc1)c1ccc(\C=C\C(O)=O)cc1)c1ccccc1
Show InChI InChI=1S/C25H22O3/c1-2-23(19-6-4-3-5-7-19)25(21-13-15-22(26)16-14-21)20-11-8-18(9-12-20)10-17-24(27)28/h3-17,26H,2H2,1H3,(H,27,28)/b17-10+,25-23+
1n/an/an/an/an/an/an/an/a
The Scripps Research Institute
Curated by ChEMBL
Assay Description
Displacement of [3H]estradiol from full-length human ERalpha receptor by scintillation counting
J Med Chem 60: 6321-6336 (2017)
Article DOI: 10.1021/acs.jmedchem.7b00585
BindingDB Entry DOI: 10.7270/Q2RB76V7
Estrogen receptor
(Homo sapiens (Human))
BDBM50238736
(CHEMBL1091535 | GW7604)
Show SMILES CCC(=C(c1ccc(O)cc1)c1ccc(\C=C\C(O)=O)cc1)c1ccccc1
Show InChI InChI=1S/C25H22O3/c1-2-23(19-6-4-3-5-7-19)25(21-13-15-22(26)16-14-21)20-11-8-18(9-12-20)10-17-24(27)28/h3-17,26H,2H2,1H3,(H,27,28)/b17-10+,25-23+
n/an/a 6.80n/an/an/an/an/an/a
Trinity College
Curated by ChEMBL
Assay Description
Displacement of fluorescein-labeled estradiol (fluoromone) from human recombinant full-length estrogen receptor beta after 2 hrs by fluorescence pola...
J Med Chem 61: 514-534 (2018)
Article DOI: 10.1021/acs.jmedchem.6b01917
BindingDB Entry DOI: 10.7270/Q20K2C6G
Estrogen receptor
(Homo sapiens (Human))
BDBM50238736
(CHEMBL1091535 | GW7604)
Show SMILES CCC(=C(c1ccc(O)cc1)c1ccc(\C=C\C(O)=O)cc1)c1ccccc1
Show InChI InChI=1S/C25H22O3/c1-2-23(19-6-4-3-5-7-19)25(21-13-15-22(26)16-14-21)20-11-8-18(9-12-20)10-17-24(27)28/h3-17,26H,2H2,1H3,(H,27,28)/b17-10+,25-23+
n/an/a 4.40n/an/an/an/an/an/a
Trinity College
Curated by ChEMBL
Assay Description
Displacement of fluorescein-labeled estradiol (fluoromone) from human recombinant full-length estrogen receptor alpha after 2 hrs by fluorescence pol...
J Med Chem 61: 514-534 (2018)
Article DOI: 10.1021/acs.jmedchem.6b01917
BindingDB Entry DOI: 10.7270/Q20K2C6G