BDBM50239482 CHEMBL1683001
SMILES: Cc1cc(CCC(O)=O)cc(C)c1-c1nc2ccc(cc2[nH]1)C(=O)Nc1ccc2ccccc2n1
InChI Key: InChIKey=YNLOODBDGBLPCM-UHFFFAOYSA-N
Data: 2 IC50
Activity Spreadsheet -- Enzyme Inhibition Constant Data from BindingDB
Found 2 hits for monomerid = 50239482
Trg + Lig
Ki
nM
ΔG°
kcal/mole
IC50
nM
Kd
nM
EC50/IC50
nM
koff
s-1
kon
M-1s-1
pHTemp
°C
Diacylglycerol O-acyltransferase 1 (DGAT1)
(Homo sapiens (Human))
BDBM50239482
(CHEMBL1683001)
Show SMILES Cc1cc(CCC(O)=O)cc(C)c1-c1nc2ccc(cc2[nH]1)C(=O)Nc1ccc2ccccc2n1
Show InChI InChI=1S/C28H24N4O3/c1-16-13-18(7-12-25(33)34)14-17(2)26(16)27-30-22-10-8-20(15-23(22)31-27)28(35)32-24-11-9-19-5-3-4-6-21(19)29-24/h3-6,8-11,13-15H,7,12H2,1-2H3,(H,30,31)(H,33,34)(H,29,32,35)
n/an/a 14n/an/an/an/an/an/a
Novartis Institutes for Biomedical Research
Curated by ChEMBL
Assay Description
Inhibition of recombinant human His6-tagged DGAT1 expressed in Sf9 insect cell membranes assessed as inhibition of triglyceride formation using diole...
J Med Chem 60: 4657-4664 (2017)
Article DOI: 10.1021/acs.jmedchem.7b00173
BindingDB Entry DOI: 10.7270/Q2B27XF2
Diacylglycerol O-acyltransferase 1
(Mus musculus (mouse))
BDBM50239482
(CHEMBL1683001)
Show SMILES Cc1cc(CCC(O)=O)cc(C)c1-c1nc2ccc(cc2[nH]1)C(=O)Nc1ccc2ccccc2n1
Show InChI InChI=1S/C28H24N4O3/c1-16-13-18(7-12-25(33)34)14-17(2)26(16)27-30-22-10-8-20(15-23(22)31-27)28(35)32-24-11-9-19-5-3-4-6-21(19)29-24/h3-6,8-11,13-15H,7,12H2,1-2H3,(H,30,31)(H,33,34)(H,29,32,35)
Reactome pathway
n/an/a 913n/an/an/an/an/an/a
Novartis Institutes for Biomedical Research
Curated by ChEMBL
Assay Description
Inhibition of DGTA1 in mouse C2C12 cells assessed as inhibition of triglyceride formation after 2 hrs by LC/MS/MS analysis
J Med Chem 60: 4657-4664 (2017)
Article DOI: 10.1021/acs.jmedchem.7b00173
BindingDB Entry DOI: 10.7270/Q2B27XF2