BDBM50240228 CHEMBL4060882
SMILES: CN1CCN(Cc2ccc(NC(=O)c3ccc(C)c(NC(=O)c4cccc(c4)-c4cccnc4)c3)cc2C(F)(F)F)CC1
InChI Key: InChIKey=KBCISYCUHRRWQT-UHFFFAOYSA-N
Data: 2 IC50
Activity Spreadsheet -- Enzyme Inhibition Constant Data from BindingDB
Found 2 hits for monomerid = 50240228
Trg + Lig
Ki
nM
ΔG°
kcal/mole
IC50
nM
Kd
nM
EC50/IC50
nM
koff
s-1
kon
M-1s-1
pHTemp
°C
Macrophage colony stimulating factor receptor
(Homo sapiens (Human))
BDBM50240228
(CHEMBL4060882)
Show SMILES CN1CCN(Cc2ccc(NC(=O)c3ccc(C)c(NC(=O)c4cccc(c4)-c4cccnc4)c3)cc2C(F)(F)F)CC1
Show InChI InChI=1S/C33H32F3N5O2/c1-22-8-9-25(18-30(22)39-32(43)24-6-3-5-23(17-24)26-7-4-12-37-20-26)31(42)38-28-11-10-27(29(19-28)33(34,35)36)21-41-15-13-40(2)14-16-41/h3-12,17-20H,13-16,21H2,1-2H3,(H,38,42)(H,39,43)
n/an/a 20n/an/an/an/an/an/a
Integral BioSciences Pvt. Ltd
Curated by ChEMBL
Assay Description
Inhibition of human CSF1R using poly[Glu:Tyr] (4:1) as substrate incubated for 2 hrs in presence of [33gammaP]ATP by P81 ion exchange chromatographic...
Bioorg Med Chem Lett 27: 2153-2160 (2017)
Article DOI: 10.1016/j.bmcl.2017.03.064
BindingDB Entry DOI: 10.7270/Q2SX6GC2
Mast/stem cell growth factor receptor Kit
(Homo sapiens (Human))
BDBM50240228
(CHEMBL4060882)
Show SMILES CN1CCN(Cc2ccc(NC(=O)c3ccc(C)c(NC(=O)c4cccc(c4)-c4cccnc4)c3)cc2C(F)(F)F)CC1
Show InChI InChI=1S/C33H32F3N5O2/c1-22-8-9-25(18-30(22)39-32(43)24-6-3-5-23(17-24)26-7-4-12-37-20-26)31(42)38-28-11-10-27(29(19-28)33(34,35)36)21-41-15-13-40(2)14-16-41/h3-12,17-20H,13-16,21H2,1-2H3,(H,38,42)(H,39,43)
n/an/a 210n/an/an/an/an/an/a
Integral BioSciences Pvt. Ltd
Curated by ChEMBL
Assay Description
Inhibition of human c-Kit using poly[Glu:Tyr] (4:1) as substrate measured after 2 hrs in presence of [33gammaP]ATP by P18 ion exchange chromatographi...
Bioorg Med Chem Lett 27: 2153-2160 (2017)
Article DOI: 10.1016/j.bmcl.2017.03.064
BindingDB Entry DOI: 10.7270/Q2SX6GC2