BDBM50249876 CHEMBL490934::N-{4-[3-(2-Amino-4-oxo-3,4-dihydrothieno[2,3-d]pyrimidin-6-yl)-propyl]benzoyl}-L-glutamic Acid
SMILES: Nc1nc2sc(CCCc3ccc(cc3)C(=O)N[C@@H](CCC(O)=O)C(O)=O)cc2c(=O)[nH]1
InChI Key: InChIKey=JPNVUHMAMNATQU-HNNXBMFYSA-N
Data: 2 IC50
Activity Spreadsheet -- Enzyme Inhibition Constant Data from BindingDB
Found 2 hits for monomerid = 50249876
Trg + Lig
Ki
nM
ΔG°
kcal/mole
IC50
nM
Kd
nM
EC50/IC50
nM
koff
s-1
kon
M-1s-1
pHTemp
°C
Glycinamide ribonucleotide formyltransferase (GARFTase)
(Homo sapiens (Human))
BDBM50249876
(CHEMBL490934 | N-{4-[3-(2-Amino-4-oxo-3,4-dihydrot...)
Show SMILES Nc1nc2sc(CCCc3ccc(cc3)C(=O)N[C@@H](CCC(O)=O)C(O)=O)cc2c(=O)[nH]1 |r|
Show InChI InChI=1S/C21H22N4O6S/c22-21-24-18(29)14-10-13(32-19(14)25-21)3-1-2-11-4-6-12(7-5-11)17(28)23-15(20(30)31)8-9-16(26)27/h4-7,10,15H,1-3,8-9H2,(H,23,28)(H,26,27)(H,30,31)(H3,22,24,25,29)/t15-/m0/s1
n/an/a 14n/an/an/an/an/an/a
Wayne State University School of Medicine
Curated by ChEMBL
Assay Description
Inhibition of GARFTase in human KB cells assessed as inhibition of incorporation of [14C]glycine into [14C]formyl GAR after 30 mins in presence of az...
J Med Chem 52: 2940-51 (2009)
Article DOI: 10.1021/jm8011323
BindingDB Entry DOI: 10.7270/Q2NG4QH8
GAR transformylase
(Mus musculus)
BDBM50249876
(CHEMBL490934 | N-{4-[3-(2-Amino-4-oxo-3,4-dihydrot...)
Show SMILES Nc1nc2sc(CCCc3ccc(cc3)C(=O)N[C@@H](CCC(O)=O)C(O)=O)cc2c(=O)[nH]1 |r|
Show InChI InChI=1S/C21H22N4O6S/c22-21-24-18(29)14-10-13(32-19(14)25-21)3-1-2-11-4-6-12(7-5-11)17(28)23-15(20(30)31)8-9-16(26)27/h4-7,10,15H,1-3,8-9H2,(H,23,28)(H,26,27)(H,30,31)(H3,22,24,25,29)/t15-/m0/s1
n/an/a 8.52E+3n/an/an/an/an/an/a
Wayne State University School of Medicine
Curated by ChEMBL
Assay Description
Inhibition of mouse recombinant GARFTase
J Med Chem 52: 2940-51 (2009)
Article DOI: 10.1021/jm8011323
BindingDB Entry DOI: 10.7270/Q2NG4QH8