BDBM50255476 2-((3-(3-(4-bromophenyl)benzo[d]isothiazol-6-yl)prop-2-ynyl)(ethyl)amino)ethanol::CHEMBL481622
SMILES: CCN(CCO)CC#Cc1ccc2c(nsc2c1)-c1ccc(Br)cc1
InChI Key: InChIKey=VTPNTVUICORZGI-UHFFFAOYSA-N
Data: 3 IC50
Activity Spreadsheet -- Enzyme Inhibition Constant Data from BindingDB
Found 3 hits for monomerid = 50255476
Trg + Lig
Ki
nM
ΔG°
kcal/mole
IC50
nM
Kd
nM
EC50/IC50
nM
koff
s-1
kon
M-1s-1
pHTemp
°C
Lanosterol synthase
(Saccharomyces cerevisiae)
BDBM50255476
(2-((3-(3-(4-bromophenyl)benzo[d]isothiazol-6-yl)pr...)
Show SMILES CCN(CCO)CC#Cc1ccc2c(nsc2c1)-c1ccc(Br)cc1
Show InChI InChI=1S/C20H19BrN2OS/c1-2-23(12-13-24)11-3-4-15-5-10-18-19(14-15)25-22-20(18)16-6-8-17(21)9-7-16/h5-10,14,24H,2,11-13H2,1H3
Reactome pathway
n/an/a 300n/an/an/an/an/an/a
Università di Torino
Curated by ChEMBL
Assay Description
Inhibition of yeast OSC expressed in Saccharomyces cerevisiae SMY8
Bioorg Med Chem Lett 19: 718-23 (2009)
Article DOI: 10.1016/j.bmcl.2008.12.040
BindingDB Entry DOI: 10.7270/Q2SF2W2N
Lanosterol synthase
(Homo sapiens (Human))
BDBM50255476
(2-((3-(3-(4-bromophenyl)benzo[d]isothiazol-6-yl)pr...)
Show SMILES CCN(CCO)CC#Cc1ccc2c(nsc2c1)-c1ccc(Br)cc1
Show InChI InChI=1S/C20H19BrN2OS/c1-2-23(12-13-24)11-3-4-15-5-10-18-19(14-15)25-22-20(18)16-6-8-17(21)9-7-16/h5-10,14,24H,2,11-13H2,1H3
Reactome pathway
n/an/a 4.60E+3n/an/an/an/an/an/a
Università di Torino
Curated by ChEMBL
Assay Description
Inhibition of human OSC expressed in Saccharomyces cerevisiae SMY8
Bioorg Med Chem Lett 19: 718-23 (2009)
Article DOI: 10.1016/j.bmcl.2008.12.040
BindingDB Entry DOI: 10.7270/Q2SF2W2N
Cycloartenol synthase
(Arabidopsis thaliana)
BDBM50255476
(2-((3-(3-(4-bromophenyl)benzo[d]isothiazol-6-yl)pr...)
Show SMILES CCN(CCO)CC#Cc1ccc2c(nsc2c1)-c1ccc(Br)cc1
Show InChI InChI=1S/C20H19BrN2OS/c1-2-23(12-13-24)11-3-4-15-5-10-18-19(14-15)25-22-20(18)16-6-8-17(21)9-7-16/h5-10,14,24H,2,11-13H2,1H3
Reactome pathway
n/an/a 550n/an/an/an/an/an/a
Università di Torino
Curated by ChEMBL
Assay Description
Inhibition of Arabidopsis thaliana cycloartenol synthase expressed in Saccharomyces cerevisiae SMY8
Bioorg Med Chem Lett 19: 718-23 (2009)
Article DOI: 10.1016/j.bmcl.2008.12.040
BindingDB Entry DOI: 10.7270/Q2SF2W2N