null
SMILES: CCC(=O)NCCNC(=O)CCc1cn(CCCCC2CCN(CC(=O)N3c4ccccc4NC(=O)c4ccccc34)CC2)cn1
InChI Key: InChIKey=SADFFAQSWHTWLL-UHFFFAOYSA-N
Activity Spreadsheet -- Enzyme Inhibition Constant Data from BindingDB
Found 11 hits for monomerid = 50265996
Trg + Lig
Ki
nM
ΔG°
kcal/mole
IC50
nM
Kd
nM
EC50/IC50
nM
koff
s-1
kon
M-1s-1
pHTemp
°C
Muscarinic acetylcholine receptor M2
(Homo sapiens (Human))
BDBM50265996
(CHEMBL4059733)
Show SMILES CCC(=O)NCCNC(=O)CCc1cn(CCCCC2CCN(CC(=O)N3c4ccccc4NC(=O)c4ccccc34)CC2)cn1
Show InChI InChI=1S/C35H45N7O4/c1-2-32(43)36-18-19-37-33(44)15-14-27-23-41(25-38-27)20-8-7-9-26-16-21-40(22-17-26)24-34(45)42-30-12-5-3-10-28(30)35(46)39-29-11-4-6-13-31(29)42/h3-6,10-13,23,25-26H,2,7-9,14-22,24H2,1H3,(H,36,43)(H,37,44)(H,39,46)
0.759n/an/an/an/an/an/an/an/a
University of Regensburg
Curated by ChEMBL
Assay Description
Displacement of [3H]NMS from human muscarinic acetylcholine receptor M2 expressed in CHOK9 cells after 3 hrs by liquid scintillation counting assay
J Med Chem 60: 3314-3334 (2017)
Article DOI: 10.1021/acs.jmedchem.6b01892
BindingDB Entry DOI: 10.7270/Q29S1THC
Muscarinic acetylcholine receptor M2
(Homo sapiens (Human))
BDBM50265996
(CHEMBL4059733)
Show SMILES CCC(=O)NCCNC(=O)CCc1cn(CCCCC2CCN(CC(=O)N3c4ccccc4NC(=O)c4ccccc34)CC2)cn1
Show InChI InChI=1S/C35H45N7O4/c1-2-32(43)36-18-19-37-33(44)15-14-27-23-41(25-38-27)20-8-7-9-26-16-21-40(22-17-26)24-34(45)42-30-12-5-3-10-28(30)35(46)39-29-11-4-6-13-31(29)42/h3-6,10-13,23,25-26H,2,7-9,14-22,24H2,1H3,(H,36,43)(H,37,44)(H,39,46)
0.794n/an/an/an/an/an/an/an/a
TBA
Citation and Details
Article DOI: 10.1016/j.ejmech.2021.113159
BindingDB Entry DOI: 10.7270/Q2F47SWV
Muscarinic acetylcholine receptor M2
(Homo sapiens (Human))
BDBM50265996
(CHEMBL4059733)
Show SMILES CCC(=O)NCCNC(=O)CCc1cn(CCCCC2CCN(CC(=O)N3c4ccccc4NC(=O)c4ccccc34)CC2)cn1
Show InChI InChI=1S/C35H45N7O4/c1-2-32(43)36-18-19-37-33(44)15-14-27-23-41(25-38-27)20-8-7-9-26-16-21-40(22-17-26)24-34(45)42-30-12-5-3-10-28(30)35(46)39-29-11-4-6-13-31(29)42/h3-6,10-13,23,25-26H,2,7-9,14-22,24H2,1H3,(H,36,43)(H,37,44)(H,39,46)
1.10n/an/an/an/an/an/an/an/a
University of Regensburg
Curated by ChEMBL
Assay Description
Displacement of [3H]UNSW-MK259 from human muscarinic acetylcholine receptor M2 expressed in CHOK9 cells after 3 hrs by liquid scintillation counting ...
J Med Chem 60: 3314-3334 (2017)
Article DOI: 10.1021/acs.jmedchem.6b01892
BindingDB Entry DOI: 10.7270/Q29S1THC
Muscarinic acetylcholine receptor M4
(Homo sapiens (Human))
BDBM50265996
(CHEMBL4059733)
Show SMILES CCC(=O)NCCNC(=O)CCc1cn(CCCCC2CCN(CC(=O)N3c4ccccc4NC(=O)c4ccccc34)CC2)cn1
Show InChI InChI=1S/C35H45N7O4/c1-2-32(43)36-18-19-37-33(44)15-14-27-23-41(25-38-27)20-8-7-9-26-16-21-40(22-17-26)24-34(45)42-30-12-5-3-10-28(30)35(46)39-29-11-4-6-13-31(29)42/h3-6,10-13,23,25-26H,2,7-9,14-22,24H2,1H3,(H,36,43)(H,37,44)(H,39,46)
Reactome pathway
2.5n/an/an/an/an/an/an/an/a
TBA
Citation and Details
Article DOI: 10.1016/j.ejmech.2021.113159
BindingDB Entry DOI: 10.7270/Q2F47SWV
Muscarinic acetylcholine receptor M1
(Homo sapiens (Human))
BDBM50265996
(CHEMBL4059733)
Show SMILES CCC(=O)NCCNC(=O)CCc1cn(CCCCC2CCN(CC(=O)N3c4ccccc4NC(=O)c4ccccc34)CC2)cn1
Show InChI InChI=1S/C35H45N7O4/c1-2-32(43)36-18-19-37-33(44)15-14-27-23-41(25-38-27)20-8-7-9-26-16-21-40(22-17-26)24-34(45)42-30-12-5-3-10-28(30)35(46)39-29-11-4-6-13-31(29)42/h3-6,10-13,23,25-26H,2,7-9,14-22,24H2,1H3,(H,36,43)(H,37,44)(H,39,46)
7.90n/an/an/an/an/an/an/an/a
TBA
Citation and Details
Article DOI: 10.1016/j.ejmech.2021.113159
BindingDB Entry DOI: 10.7270/Q2F47SWV
Muscarinic acetylcholine receptor M2
(Homo sapiens (Human))
BDBM50265996
(CHEMBL4059733)
Show SMILES CCC(=O)NCCNC(=O)CCc1cn(CCCCC2CCN(CC(=O)N3c4ccccc4NC(=O)c4ccccc34)CC2)cn1
Show InChI InChI=1S/C35H45N7O4/c1-2-32(43)36-18-19-37-33(44)15-14-27-23-41(25-38-27)20-8-7-9-26-16-21-40(22-17-26)24-34(45)42-30-12-5-3-10-28(30)35(46)39-29-11-4-6-13-31(29)42/h3-6,10-13,23,25-26H,2,7-9,14-22,24H2,1H3,(H,36,43)(H,37,44)(H,39,46)
10n/an/an/an/an/an/an/an/a
University of Regensburg
Curated by ChEMBL
Assay Description
Displacement of [3H]UR-AP060 from human muscarinic acetylcholine receptor M2 expressed in CHOK9 cell homogenate after 3 hrs by liquid scintillation c...
J Med Chem 60: 3314-3334 (2017)
Article DOI: 10.1021/acs.jmedchem.6b01892
BindingDB Entry DOI: 10.7270/Q29S1THC
Muscarinic acetylcholine receptor M3
(Homo sapiens (Human))
BDBM50265996
(CHEMBL4059733)
Show SMILES CCC(=O)NCCNC(=O)CCc1cn(CCCCC2CCN(CC(=O)N3c4ccccc4NC(=O)c4ccccc34)CC2)cn1
Show InChI InChI=1S/C35H45N7O4/c1-2-32(43)36-18-19-37-33(44)15-14-27-23-41(25-38-27)20-8-7-9-26-16-21-40(22-17-26)24-34(45)42-30-12-5-3-10-28(30)35(46)39-29-11-4-6-13-31(29)42/h3-6,10-13,23,25-26H,2,7-9,14-22,24H2,1H3,(H,36,43)(H,37,44)(H,39,46)
Reactome pathway
63n/an/an/an/an/an/an/an/a
TBA
Citation and Details
Article DOI: 10.1016/j.ejmech.2021.113159
BindingDB Entry DOI: 10.7270/Q2F47SWV
Muscarinic acetylcholine receptor M5
(Homo sapiens (Human))
BDBM50265996
(CHEMBL4059733)
Show SMILES CCC(=O)NCCNC(=O)CCc1cn(CCCCC2CCN(CC(=O)N3c4ccccc4NC(=O)c4ccccc34)CC2)cn1
Show InChI InChI=1S/C35H45N7O4/c1-2-32(43)36-18-19-37-33(44)15-14-27-23-41(25-38-27)20-8-7-9-26-16-21-40(22-17-26)24-34(45)42-30-12-5-3-10-28(30)35(46)39-29-11-4-6-13-31(29)42/h3-6,10-13,23,25-26H,2,7-9,14-22,24H2,1H3,(H,36,43)(H,37,44)(H,39,46)
Reactome pathway
158n/an/an/an/an/an/an/an/a
TBA
Citation and Details
Article DOI: 10.1016/j.ejmech.2021.113159
BindingDB Entry DOI: 10.7270/Q2F47SWV
Muscarinic acetylcholine receptor M2
(Homo sapiens (Human))
BDBM50265996
(CHEMBL4059733)
Show SMILES CCC(=O)NCCNC(=O)CCc1cn(CCCCC2CCN(CC(=O)N3c4ccccc4NC(=O)c4ccccc34)CC2)cn1
Show InChI InChI=1S/C35H45N7O4/c1-2-32(43)36-18-19-37-33(44)15-14-27-23-41(25-38-27)20-8-7-9-26-16-21-40(22-17-26)24-34(45)42-30-12-5-3-10-28(30)35(46)39-29-11-4-6-13-31(29)42/h3-6,10-13,23,25-26H,2,7-9,14-22,24H2,1H3,(H,36,43)(H,37,44)(H,39,46)
n/an/a 355n/an/an/an/an/an/a
University of Regensburg
Curated by ChEMBL
Assay Description
Competitive antagonist activity at human muscarinic acetylcholine receptor M2 expressed in HEK293 cells coexpressing HA tagged Galpha-protein qi5 ass...
J Med Chem 60: 3314-3334 (2017)
Article DOI: 10.1021/acs.jmedchem.6b01892
BindingDB Entry DOI: 10.7270/Q29S1THC
Muscarinic acetylcholine receptor M2
(Homo sapiens (Human))
BDBM50265996
(CHEMBL4059733)
Show SMILES CCC(=O)NCCNC(=O)CCc1cn(CCCCC2CCN(CC(=O)N3c4ccccc4NC(=O)c4ccccc34)CC2)cn1
Show InChI InChI=1S/C35H45N7O4/c1-2-32(43)36-18-19-37-33(44)15-14-27-23-41(25-38-27)20-8-7-9-26-16-21-40(22-17-26)24-34(45)42-30-12-5-3-10-28(30)35(46)39-29-11-4-6-13-31(29)42/h3-6,10-13,23,25-26H,2,7-9,14-22,24H2,1H3,(H,36,43)(H,37,44)(H,39,46)
n/an/a 34n/an/an/an/an/an/a
University of Regensburg
Curated by ChEMBL
Assay Description
Competitive antagonist activity at human muscarinic acetylcholine receptor M2 expressed in HEK293 cells coexpressing HA tagged Galpha-protein qi5 ass...
J Med Chem 60: 3314-3334 (2017)
Article DOI: 10.1021/acs.jmedchem.6b01892
BindingDB Entry DOI: 10.7270/Q29S1THC
Muscarinic acetylcholine receptor M2
(Homo sapiens (Human))
BDBM50265996
(CHEMBL4059733)
Show SMILES CCC(=O)NCCNC(=O)CCc1cn(CCCCC2CCN(CC(=O)N3c4ccccc4NC(=O)c4ccccc34)CC2)cn1
Show InChI InChI=1S/C35H45N7O4/c1-2-32(43)36-18-19-37-33(44)15-14-27-23-41(25-38-27)20-8-7-9-26-16-21-40(22-17-26)24-34(45)42-30-12-5-3-10-28(30)35(46)39-29-11-4-6-13-31(29)42/h3-6,10-13,23,25-26H,2,7-9,14-22,24H2,1H3,(H,36,43)(H,37,44)(H,39,46)
n/an/a 85n/an/an/an/an/an/a
University of Regensburg
Curated by ChEMBL
Assay Description
Competitive antagonist activity at human muscarinic acetylcholine receptor M2 expressed in HEK293 cells coexpressing HA tagged Galpha-protein qi5 ass...
J Med Chem 60: 3314-3334 (2017)
Article DOI: 10.1021/acs.jmedchem.6b01892
BindingDB Entry DOI: 10.7270/Q29S1THC