BDBM50273882 2-[3-chloro-3-phenylprop-2-enylidene]hydrazinecarboximidamide::CHEMBL458496
SMILES: [#7]\[#6](-[#7])=[#7]\[#7]=[#6]-[#6]=[#6](Cl)-c1ccccc1
InChI Key: InChIKey=SKTBDZTXCXMFAZ-UHFFFAOYSA-N
Data: 2 IC50
Activity Spreadsheet -- Enzyme Inhibition Constant Data from BindingDB
Found 2 hits for monomerid = 50273882
Trg + Lig
Ki
nM
ΔG°
kcal/mole
IC50
nM
Kd
nM
EC50/IC50
nM
koff
s-1
kon
M-1s-1
pHTemp
°C
Envelope glycoprotein gp70
(Mouse mammary tumor virus (strain GR) (MMTV))
BDBM50273882
(2-[3-chloro-3-phenylprop-2-enylidene]hydrazinecarb...)
Show SMILES [#7]\[#6](-[#7])=[#7]\[#7]=[#6]-[#6]=[#6](Cl)-c1ccccc1 |w:6.5,4.3|
Show InChI InChI=1S/C10H11ClN4/c11-9(6-7-14-15-10(12)13)8-4-2-1-3-5-8/h1-7H,(H4,12,13,15)
n/an/a 4.60E+3n/an/an/an/an/an/a
University of Illinois at Urbana-Champaign
Curated by ChEMBL
Assay Description
Inhibition of estradiol-induced coactivator peptide SRC1 binding to estrogen receptor alpha (unknown origin) expressed in human HEC1 cells after 24 h...
Bioorg Med Chem 16: 10075-84 (2008)
Article DOI: 10.1016/j.bmc.2008.10.007
BindingDB Entry DOI: 10.7270/Q28915Q2
Gag polyprotein
(Avian erythroblastosis virus (strain ES4))
BDBM50273882
(2-[3-chloro-3-phenylprop-2-enylidene]hydrazinecarb...)
Show SMILES [#7]\[#6](-[#7])=[#7]\[#7]=[#6]-[#6]=[#6](Cl)-c1ccccc1 |w:6.5,4.3|
Show InChI InChI=1S/C10H11ClN4/c11-9(6-7-14-15-10(12)13)8-4-2-1-3-5-8/h1-7H,(H4,12,13,15)
n/an/a 900n/an/an/an/an/an/a
University of Illinois at Urbana-Champaign
Curated by ChEMBL
Assay Description
Antagonist activity at estrogen receptor alpha (unknown origin) expressed in human HEC1 cells assessed as inhibition of 1 nM estradiol-induced transc...
Bioorg Med Chem 16: 10075-84 (2008)
Article DOI: 10.1016/j.bmc.2008.10.007
BindingDB Entry DOI: 10.7270/Q28915Q2