BDBM50275710 CHEMBL486738::N-(2-aminophenyl)-6-(2,3-dihydro-1H-spiro[isoquinoline-4,4'-piperidine]-1'-yl)nicotinamide
SMILES: Nc1ccccc1NC(=O)c1ccc(nc1)N1CCC2(CC1)CNCc1ccccc21
InChI Key: InChIKey=GYKGIINXSOHHAI-UHFFFAOYSA-N
Data: 1 KI  1 IC50
Activity Spreadsheet -- Enzyme Inhibition Constant Data from BindingDB
Found 2 hits for monomerid = 50275710
Trg + Lig
Ki
nM
ΔG°
kcal/mole
IC50
nM
Kd
nM
EC50/IC50
nM
koff
s-1
kon
M-1s-1
pHTemp
°C
Potassium voltage-gated channel subfamily H member 2
(Homo sapiens (Human))
BDBM50275710
(CHEMBL486738 | N-(2-aminophenyl)-6-(2,3-dihydro-1H...)
Show SMILES Nc1ccccc1NC(=O)c1ccc(nc1)N1CCC2(CC1)CNCc1ccccc21
Show InChI InChI=1S/C25H27N5O/c26-21-7-3-4-8-22(21)29-24(31)19-9-10-23(28-16-19)30-13-11-25(12-14-30)17-27-15-18-5-1-2-6-20(18)25/h1-10,16,27H,11-15,17,26H2,(H,29,31)
Reactome pathway
1.76E+3n/an/an/an/an/an/an/an/a
Merck Research Laboratories
Curated by ChEMBL
Assay Description
Displacement of [35S]MK499 from human ERG expressed in HEK293 cells
Bioorg Med Chem Lett 18: 6104-9 (2008)
Article DOI: 10.1016/j.bmcl.2008.10.052
BindingDB Entry DOI: 10.7270/Q23R0SQ2
Histone deacetylase 1
(Homo sapiens (Human))
BDBM50275710
(CHEMBL486738 | N-(2-aminophenyl)-6-(2,3-dihydro-1H...)
Show SMILES Nc1ccccc1NC(=O)c1ccc(nc1)N1CCC2(CC1)CNCc1ccccc21
Show InChI InChI=1S/C25H27N5O/c26-21-7-3-4-8-22(21)29-24(31)19-9-10-23(28-16-19)30-13-11-25(12-14-30)17-27-15-18-5-1-2-6-20(18)25/h1-10,16,27H,11-15,17,26H2,(H,29,31)
NCI pathway
Reactome pathway
n/an/a 89n/an/an/an/an/an/a
Merck Research Laboratories
Curated by ChEMBL
Assay Description
Inhibition of human HDAC1 expressed in mammalian cells
Bioorg Med Chem Lett 18: 6104-9 (2008)
Article DOI: 10.1016/j.bmcl.2008.10.052
BindingDB Entry DOI: 10.7270/Q23R0SQ2