null
SMILES: Clc1ccc(cc1)S(=O)(=O)N1CC(=O)c2ccccc2-c2ccccc12
InChI Key: InChIKey=NCQAFCHSYFCQQI-UHFFFAOYSA-N
Activity Spreadsheet -- Enzyme Inhibition Constant Data from BindingDB
Found 2 hits for monomerid = 50279065
Trg + Lig
Ki
nM
ΔG°
kcal/mole
IC50
nM
Kd
nM
EC50/IC50
nM
koff
s-1
kon
M-1s-1
pHTemp
°C
Potassium voltage-gated channel subfamily A member 3
(Homo sapiens (Human))
BDBM50279065
(5-(4-chlorophenylsulfonyl)-5H-dibenzo[b,d]azepin-7...)
Show SMILES Clc1ccc(cc1)S(=O)(=O)N1CC(=O)c2ccccc2-c2ccccc12
Show InChI InChI=1S/C20H14ClNO3S/c21-14-9-11-15(12-10-14)26(24,25)22-13-20(23)18-7-2-1-5-16(18)17-6-3-4-8-19(17)22/h1-12H,13H2
Reactome pathway
n/an/a 6.10E+3n/an/an/an/an/an/a
4SC AG
Curated by ChEMBL
Assay Description
Inhibition of cloned Kv1.3 channel (unknown origin) expressed in mammalian cells by whole cell patch clamp assay
Bioorg Med Chem Lett 19: 2299-304 (2009)
Article DOI: 10.1016/j.bmcl.2009.02.077
BindingDB Entry DOI: 10.7270/Q29K4B38
Intermediate conductance calcium-activated potassium channel protein 4
(Homo sapiens (Human))
BDBM50279065
(5-(4-chlorophenylsulfonyl)-5H-dibenzo[b,d]azepin-7...)
Show SMILES Clc1ccc(cc1)S(=O)(=O)N1CC(=O)c2ccccc2-c2ccccc12
Show InChI InChI=1S/C20H14ClNO3S/c21-14-9-11-15(12-10-14)26(24,25)22-13-20(23)18-7-2-1-5-16(18)17-6-3-4-8-19(17)22/h1-12H,13H2
Reactome pathway
n/an/a 1.40E+3n/an/an/an/an/an/a
4SC AG
Curated by ChEMBL
Assay Description
Inhibition of human cloned IK1 expressed in african green monkey COS7 cells by whole cell patch clamp assay
Bioorg Med Chem Lett 19: 2299-304 (2009)
Article DOI: 10.1016/j.bmcl.2009.02.077
BindingDB Entry DOI: 10.7270/Q29K4B38