BDBM50280524 2-Methyl-6-pyrrolidin-1-yl-hex-4-ynal oxime::CHEMBL163661
SMILES: CC(CN=O)CC#CCN1CCCC1
InChI Key: InChIKey=GMFWCDSZRLSMRO-UHFFFAOYSA-N
Data: 4 IC50
Activity Spreadsheet -- Enzyme Inhibition Constant Data from BindingDB
Found 4 hits for monomerid = 50280524
Trg + Lig
Ki
nM
ΔG°
kcal/mole
IC50
nM
Kd
nM
EC50/IC50
nM
koff
s-1
kon
M-1s-1
pHTemp
°C
Muscarinic acetylcholine receptor M2
(RAT)
BDBM50280524
(2-Methyl-6-pyrrolidin-1-yl-hex-4-ynal oxime | CHEM...)
Show SMILES CC(CN=O)CC#CCN1CCCC1
Show InChI InChI=1S/C11H18N2O/c1-11(10-12-14)6-2-3-7-13-8-4-5-9-13/h11H,4-10H2,1H3
Reactome pathway
n/an/a 5.50E+3n/an/an/an/an/an/a
TBA
Curated by ChEMBL
Assay Description
Displacement of [3H]-QNB from Muscarinic acetylcholine receptor M2 from rat heart homogenates
Bioorg Med Chem Lett 2: 803-808 (1992)
Article DOI: 10.1016/S0960-894X(00)80535-1
BindingDB Entry DOI: 10.7270/Q2Z0382N
Muscarinic acetylcholine receptor
(RAT)
BDBM50280524
(2-Methyl-6-pyrrolidin-1-yl-hex-4-ynal oxime | CHEM...)
Show SMILES CC(CN=O)CC#CCN1CCCC1
Show InChI InChI=1S/C11H18N2O/c1-11(10-12-14)6-2-3-7-13-8-4-5-9-13/h11H,4-10H2,1H3
NCI pathway
Reactome pathway
n/an/a 1.93E+3n/an/an/an/an/an/a
TBA
Curated by ChEMBL
Assay Description
Inhibition of 0.03 nM [3H]quinuclidinyl benzylate binding to rat neocortex muscarinic receptor
Bioorg Med Chem Lett 2: 803-808 (1992)
Article DOI: 10.1016/S0960-894X(00)80535-1
BindingDB Entry DOI: 10.7270/Q2Z0382N
Muscarinic acetylcholine receptor
(RAT)
BDBM50280524
(2-Methyl-6-pyrrolidin-1-yl-hex-4-ynal oxime | CHEM...)
Show SMILES CC(CN=O)CC#CCN1CCCC1
Show InChI InChI=1S/C11H18N2O/c1-11(10-12-14)6-2-3-7-13-8-4-5-9-13/h11H,4-10H2,1H3
NCI pathway
Reactome pathway
n/an/a 21n/an/an/an/an/an/a
TBA
Curated by ChEMBL
Assay Description
Inhibition of 0.1 nM [3H]cis-methyldioxolane binding to rat neocortex muscarinic receptor
Bioorg Med Chem Lett 2: 803-808 (1992)
Article DOI: 10.1016/S0960-894X(00)80535-1
BindingDB Entry DOI: 10.7270/Q2Z0382N
Muscarinic acetylcholine receptor M1
(Homo sapiens (Human))
BDBM50280524
(2-Methyl-6-pyrrolidin-1-yl-hex-4-ynal oxime | CHEM...)
Show SMILES CC(CN=O)CC#CCN1CCCC1
Show InChI InChI=1S/C11H18N2O/c1-11(10-12-14)6-2-3-7-13-8-4-5-9-13/h11H,4-10H2,1H3
n/an/a 920n/an/an/an/an/an/a
TBA
Curated by ChEMBL
Assay Description
Displacement of [3H]-QNB in genetically transformed mouse cell line (m1C2) transfected with Muscarinic acetylcholine receptor M1
Bioorg Med Chem Lett 2: 803-808 (1992)
Article DOI: 10.1016/S0960-894X(00)80535-1
BindingDB Entry DOI: 10.7270/Q2Z0382N