BDBM50284071 CHEMBL4165927
SMILES: Cc1ccc(cc1)C(c1c[nH]c2ccc(cc12)C(=O)N\N=C\c1cc(O)c(O)cc1O)c1c[nH]c2ccc(cc12)C(=O)N\N=C\c1cc(O)c(O)cc1O
InChI Key: InChIKey=SSYDGTIDKNHOFD-CRVCDQDGSA-N
Data: 1 IC50
Activity Spreadsheet -- Enzyme Inhibition Constant Data from BindingDB
Found 1 hit for monomerid = 50284071
Trg + Lig
Ki
nM
ΔG°
kcal/mole
IC50
nM
Kd
nM
EC50/IC50
nM
koff
s-1
kon
M-1s-1
pHTemp
°C
beta-Glucuronidase (β-glucuronidase)
(Homo sapiens (Human))
BDBM50284071
(CHEMBL4165927)
Show SMILES Cc1ccc(cc1)C(c1c[nH]c2ccc(cc12)C(=O)N\N=C\c1cc(O)c(O)cc1O)c1c[nH]c2ccc(cc12)C(=O)N\N=C\c1cc(O)c(O)cc1O
Show InChI InChI=1S/C40H32N6O8/c1-20-2-4-21(5-3-20)38(28-18-41-30-8-6-22(10-26(28)30)39(53)45-43-16-24-12-34(49)36(51)14-32(24)47)29-19-42-31-9-7-23(11-27(29)31)40(54)46-44-17-25-13-35(50)37(52)15-33(25)48/h2-19,38,41-42,47-52H,1H3,(H,45,53)(H,46,54)/b43-16+,44-17+
n/an/a 100n/an/an/an/an/an/a
Imam Abdulrahman Bin Faisal University
Curated by ChEMBL
Assay Description
Inhibition of human beta-glucuronidase
Eur J Med Chem 143: 1757-1767 (2018)
Article DOI: 10.1016/j.ejmech.2017.10.071
BindingDB Entry DOI: 10.7270/Q23N25X1