BDBM50284196 C32-O-cinnamyl ether analogue of L-683590::CHEMBL174029
SMILES: CC[C@@H]1\C=C(C)\C[C@H](C)C[C@H](OC)[C@H]2OC(O)([C@@H](C)C[C@@H]2OC)C(=O)C(=O)N2CCCC[C@H]2C(=O)O[C@@H]([C@H](C)[C@@H](O)CC1=O)C(\C)=C\[C@@H]1CC[C@@H](OC(C)C=C)[C@H](O)C1
InChI Key: InChIKey=PTWGWPDVGQPKNC-KNGXYXDQSA-N
Data: 1 EC50
Activity Spreadsheet -- Enzyme Inhibition Constant Data from BindingDB
Found 1 hit for monomerid = 50284196
Trg + Lig
Ki
nM
ΔG°
kcal/mole
IC50
nM
Kd
nM
EC50/IC50
nM
koff
s-1
kon
M-1s-1
pHTemp
°C
Peptidyl-prolyl cis-trans isomerase FKBP1A
(Homo sapiens (Human))
BDBM50284196
(C32-O-cinnamyl ether analogue of L-683590 | CHEMBL...)
Show SMILES CC[C@@H]1\C=C(C)\C[C@H](C)C[C@H](OC)[C@H]2OC(O)([C@@H](C)C[C@@H]2OC)C(=O)C(=O)N2CCCC[C@H]2C(=O)O[C@@H]([C@H](C)[C@@H](O)CC1=O)C(\C)=C\[C@@H]1CC[C@@H](OC(C)C=C)[C@H](O)C1 |c:3|
Show InChI InChI=1S/C46H73NO12/c1-11-30(7)57-38-17-16-32(24-37(38)50)22-28(5)41-31(8)35(48)25-36(49)33(12-2)20-26(3)19-27(4)21-39(55-9)42-40(56-10)23-29(6)46(54,59-42)43(51)44(52)47-18-14-13-15-34(47)45(53)58-41/h11,20,22,27,29-35,37-42,48,50,54H,1,12-19,21,23-25H2,2-10H3/b26-20+,28-22+/t27-,29-,30?,31+,32-,33+,34-,35-,37+,38+,39-,40-,41+,42+,46?/m0/s1
NCI pathway
Reactome pathway
n/an/an/an/a 15n/an/an/an/a
TBA
Curated by ChEMBL
Assay Description
Ability to bind the major cystolic receptor FK506 binding protein 12 by using competitive binding assay
Bioorg Med Chem Lett 4: 927-930 (1994)
Article DOI: 10.1016/S0960-894X(01)80265-1
BindingDB Entry DOI: 10.7270/Q2CN73VP