BDBM50286501 5-Cyclopropyl-2-(3-dimethylamino-propyl)-7-(2,6-dimethyl-pyridin-4-yl)-6,8-difluoro-2,5-dihydro-pyrazolo[4,3-c]quinolin-3-one::CHEMBL131677
SMILES: CN(C)CCCn1nc2c(cn(C3CC3)c3c(F)c(c(F)cc23)-c2cc(C)nc(C)c2)c1=O
InChI Key: InChIKey=LCNWCSDIWMMKCH-UHFFFAOYSA-N
Data: 2 EC50
Activity Spreadsheet -- Enzyme Inhibition Constant Data from BindingDB
Found 2 hits for monomerid = 50286501
Trg + Lig
Ki
nM
ΔG°
kcal/mole
IC50
nM
Kd
nM
EC50/IC50
nM
koff
s-1
kon
M-1s-1
pHTemp
°C
DNA topoisomerase II
(Homo sapiens (Human))
BDBM50286501
(5-Cyclopropyl-2-(3-dimethylamino-propyl)-7-(2,6-di...)
Show SMILES CN(C)CCCn1nc2c(cn(C3CC3)c3c(F)c(c(F)cc23)-c2cc(C)nc(C)c2)c1=O
Show InChI InChI=1S/C25H27F2N5O/c1-14-10-16(11-15(2)28-14)21-20(26)12-18-23-19(13-31(17-6-7-17)24(18)22(21)27)25(33)32(29-23)9-5-8-30(3)4/h10-13,17H,5-9H2,1-4H3
n/an/an/an/a 1.70E+3n/an/an/an/a
TBA
Curated by ChEMBL
Assay Description
Compound was tested for topoisomerase II inhibition in purified HeLa cells by SDS/K+ precipitation method
Bioorg Med Chem Lett 5: 405-410 (1995)
Article DOI: 10.1016/0960-894X(95)00044-T
BindingDB Entry DOI: 10.7270/Q2CZ37N7
DNA topoisomerase II
(Homo sapiens (Human))
BDBM50286501
(5-Cyclopropyl-2-(3-dimethylamino-propyl)-7-(2,6-di...)
Show SMILES CN(C)CCCn1nc2c(cn(C3CC3)c3c(F)c(c(F)cc23)-c2cc(C)nc(C)c2)c1=O
Show InChI InChI=1S/C25H27F2N5O/c1-14-10-16(11-15(2)28-14)21-20(26)12-18-23-19(13-31(17-6-7-17)24(18)22(21)27)25(33)32(29-23)9-5-8-30(3)4/h10-13,17H,5-9H2,1-4H3
n/an/an/an/a>5.00E+4n/an/an/an/a
TBA
Curated by ChEMBL
Assay Description
Inhibition of calf thymus DNA/ethidium bromide complex formation.
Bioorg Med Chem Lett 5: 405-410 (1995)
Article DOI: 10.1016/0960-894X(95)00044-T
BindingDB Entry DOI: 10.7270/Q2CZ37N7