BDBM50289699 (3R,4R,5S)-4-Acetylamino-5-guanidino-3-propoxy-cyclohex-1-enecarboxylic acid; TFA::CHEMBL55921
SMILES: [#6]-[#6]-[#6]-[#8]-[#6@@H]-1-[#6]=[#6](-[#6]-[#6@H](\[#7]=[#6](\[#7])-[#7])-[#6@H]-1-[#7]-[#6](-[#6])=O)-[#6](-[#8])=O
InChI Key: InChIKey=JPGVNBPJSYNZSP-HBNTYKKESA-N
Data: 1 IC50
Activity Spreadsheet -- Enzyme Inhibition Constant Data from BindingDB
Found 1 hit for monomerid = 50289699
Trg + Lig
Ki
nM
ΔG°
kcal/mole
IC50
nM
Kd
nM
EC50/IC50
nM
koff
s-1
kon
M-1s-1
pHTemp
°C
Neuraminidase A
(Influenza A virus (A/Puerto Rico/8/34/Mount Sinai(...)
BDBM50289699
((3R,4R,5S)-4-Acetylamino-5-guanidino-3-propoxy-cyc...)
Show SMILES [#6]-[#6]-[#6]-[#8]-[#6@@H]-1-[#6]=[#6](-[#6]-[#6@H](\[#7]=[#6](\[#7])-[#7])-[#6@H]-1-[#7]-[#6](-[#6])=O)-[#6](-[#8])=O |c:5|
Show InChI InChI=1S/C13H22N4O4/c1-3-4-21-10-6-8(12(19)20)5-9(17-13(14)15)11(10)16-7(2)18/h6,9-11H,3-5H2,1-2H3,(H,16,18)(H,19,20)(H4,14,15,17)/t9-,10+,11+/m0/s1
n/an/a 1.80n/an/an/an/an/an/a
Gilead Sciences Inc.
Assay Description
Inhibition of neuraminidase of influenza A/PR/8/34(H1N1)
Bioorg Med Chem Lett 7: 1837-42 (1997)
Article DOI: 10.1016/S0960-894X(97)00333-8
BindingDB Entry DOI: 10.7270/Q2FX77MK