BDBM50299278 3-Fluoro-4-(1-(1,2,3,4-tetrahydro-1,1,4,4,6-pentamethylnaphthalen-7-yl)vinyl)benzoic Acid::CHEMBL575324
SMILES: Cc1cc2c(cc1Cc1ccc(cc1F)C(O)=O)C(C)(C)CCC2(C)C
InChI Key: InChIKey=JLOLISLIYVSIJM-UHFFFAOYSA-N
Data: 1 KI  1 EC50
Activity Spreadsheet -- Enzyme Inhibition Constant Data from BindingDB
Found 2 hits for monomerid = 50299278
Trg + Lig
Ki
nM
ΔG°
kcal/mole
IC50
nM
Kd
nM
EC50/IC50
nM
koff
s-1
kon
M-1s-1
pHTemp
°C
Retinoic acid receptor RXR-alpha
(Homo sapiens (Human))
BDBM50299278
(3-Fluoro-4-(1-(1,2,3,4-tetrahydro-1,1,4,4,6-pentam...)
Show SMILES Cc1cc2c(cc1Cc1ccc(cc1F)C(O)=O)C(C)(C)CCC2(C)C
Show InChI InChI=1S/C23H27FO2/c1-14-10-18-19(23(4,5)9-8-22(18,2)3)12-17(14)11-15-6-7-16(21(25)26)13-20(15)24/h6-7,10,12-13H,8-9,11H2,1-5H3,(H,25,26)
NCI pathway
Reactome pathway
161n/an/an/an/an/an/an/an/a
Arizona State University
Curated by ChEMBL
Assay Description
Displacement of [3H]-9-cis-retinoic acid form human RXRalpha expressed in human Caco2 cells after 16 hrs
J Med Chem 52: 5950-66 (2009)
Article DOI: 10.1021/jm900496b
BindingDB Entry DOI: 10.7270/Q2Q81D41
Retinoic acid receptor RXR-alpha
(Homo sapiens (Human))
BDBM50299278
(3-Fluoro-4-(1-(1,2,3,4-tetrahydro-1,1,4,4,6-pentam...)
Show SMILES Cc1cc2c(cc1Cc1ccc(cc1F)C(O)=O)C(C)(C)CCC2(C)C
Show InChI InChI=1S/C23H27FO2/c1-14-10-18-19(23(4,5)9-8-22(18,2)3)12-17(14)11-15-6-7-16(21(25)26)13-20(15)24/h6-7,10,12-13H,8-9,11H2,1-5H3,(H,25,26)
NCI pathway
Reactome pathway
n/an/an/an/a 420n/an/an/an/a
Arizona State University
Curated by ChEMBL
Assay Description
Agonist activity at human recombinant Gal4-tagged RXRalpha expressed in human Caco2 cells assessed as receptor homodimerization after 24 hrs by mamma...
J Med Chem 52: 5950-66 (2009)
Article DOI: 10.1021/jm900496b
BindingDB Entry DOI: 10.7270/Q2Q81D41