BDBM50321607 (3S,6S,9S,12S,15R,18S,21S,27R,30S)-18-((1H-imidazol-5-yl)methyl)-9-((1H-indol-3-yl)methyl)-30-amino-3-((S)-1-amino-1-oxo-3-phenylpropan-2-ylcarbamoyl)-21-benzyl-6-butyl-12-(3-guanidinopropyl)-31-(4-hydroxyphenyl)-27-methyl-15-(naphthalen-2-ylmethyl)-5,8,11,14,17,20,23,26,29-nonaoxo-4,7,10,13,16,19,22,25,28-nonaazahentriacontan-1-oic acid::CHEMBL1172252
SMILES: CCCC[C@H](NC(=O)[C@H](Cc1c[nH]c2ccccc12)NC(=O)[C@H](CCCNC(N)=N)NC(=O)[C@@H](Cc1ccc2ccccc2c1)NC(=O)[C@H](Cc1cnc[nH]1)NC(=O)[C@H](Cc1ccccc1)NC(=O)CNC(=O)[C@@H](C)NC(=O)[C@@H](N)Cc1ccc(O)cc1)C(=O)N[C@@H](CC(O)=O)C(=O)N[C@@H](Cc1ccccc1)C(N)=O
InChI Key: InChIKey=ZZVLKHHSRQKCEV-DVZSIOPJSA-N
Data: 5 KI  6 IC50
Activity Spreadsheet -- Enzyme Inhibition Constant Data from BindingDB
Found 11 hits for monomerid = 50321607
Trg + Lig
Ki
nM
ΔG°
kcal/mole
IC50
nM
Kd
nM
EC50/IC50
nM
koff
s-1
kon
M-1s-1
pHTemp
°C
Mu-type opioid receptor
(Rattus norvegicus (rat))
BDBM50321607
((3S,6S,9S,12S,15R,18S,21S,27R,30S)-18-((1H-imidazo...)
Show SMILES CCCC[C@H](NC(=O)[C@H](Cc1c[nH]c2ccccc12)NC(=O)[C@H](CCCNC(N)=N)NC(=O)[C@@H](Cc1ccc2ccccc2c1)NC(=O)[C@H](Cc1cnc[nH]1)NC(=O)[C@H](Cc1ccccc1)NC(=O)CNC(=O)[C@@H](C)NC(=O)[C@@H](N)Cc1ccc(O)cc1)C(=O)N[C@@H](CC(O)=O)C(=O)N[C@@H](Cc1ccccc1)C(N)=O |r|
Show InChI InChI=1S/C78H94N18O14/c1-3-4-23-58(71(104)96-65(40-67(99)100)77(110)92-60(68(80)101)35-46-16-7-5-8-17-46)90-75(108)63(38-52-41-85-57-24-14-13-22-55(52)57)94-72(105)59(25-15-32-84-78(81)82)91-74(107)62(37-49-26-29-50-20-11-12-21-51(50)33-49)93-76(109)64(39-53-42-83-44-87-53)95-73(106)61(36-47-18-9-6-10-19-47)89-66(98)43-86-69(102)45(2)88-70(103)56(79)34-48-27-30-54(97)31-28-48/h5-14,16-22,24,26-31,33,41-42,44-45,56,58-65,85,97H,3-4,15,23,25,32,34-40,43,79H2,1-2H3,(H2,80,101)(H,83,87)(H,86,102)(H,88,103)(H,89,98)(H,90,108)(H,91,107)(H,92,110)(H,93,109)(H,94,105)(H,95,106)(H,96,104)(H,99,100)(H4,81,82,84)/t45-,56+,58+,59+,60+,61+,62-,63+,64+,65+/m1/s1
Reactome pathway
0.690n/an/an/an/an/an/an/an/a
University of Arizona
Curated by ChEMBL
Assay Description
Displacement of [3H]DAMGO from rat mu opioid receptor expressed in mouse HN9.10 cells
Bioorg Med Chem Lett 20: 4080-4 (2010)
Article DOI: 10.1016/j.bmcl.2010.05.078
BindingDB Entry DOI: 10.7270/Q2D79CCN
Cholecystokinin receptor
(Homo sapiens (Human))
BDBM50321607
((3S,6S,9S,12S,15R,18S,21S,27R,30S)-18-((1H-imidazo...)
Show SMILES CCCC[C@H](NC(=O)[C@H](Cc1c[nH]c2ccccc12)NC(=O)[C@H](CCCNC(N)=N)NC(=O)[C@@H](Cc1ccc2ccccc2c1)NC(=O)[C@H](Cc1cnc[nH]1)NC(=O)[C@H](Cc1ccccc1)NC(=O)CNC(=O)[C@@H](C)NC(=O)[C@@H](N)Cc1ccc(O)cc1)C(=O)N[C@@H](CC(O)=O)C(=O)N[C@@H](Cc1ccccc1)C(N)=O |r|
Show InChI InChI=1S/C78H94N18O14/c1-3-4-23-58(71(104)96-65(40-67(99)100)77(110)92-60(68(80)101)35-46-16-7-5-8-17-46)90-75(108)63(38-52-41-85-57-24-14-13-22-55(52)57)94-72(105)59(25-15-32-84-78(81)82)91-74(107)62(37-49-26-29-50-20-11-12-21-51(50)33-49)93-76(109)64(39-53-42-83-44-87-53)95-73(106)61(36-47-18-9-6-10-19-47)89-66(98)43-86-69(102)45(2)88-70(103)56(79)34-48-27-30-54(97)31-28-48/h5-14,16-22,24,26-31,33,41-42,44-45,56,58-65,85,97H,3-4,15,23,25,32,34-40,43,79H2,1-2H3,(H2,80,101)(H,83,87)(H,86,102)(H,88,103)(H,89,98)(H,90,108)(H,91,107)(H,92,110)(H,93,109)(H,94,105)(H,95,106)(H,96,104)(H,99,100)(H4,81,82,84)/t45-,56+,58+,59+,60+,61+,62-,63+,64+,65+/m1/s1
Reactome pathway
9n/an/an/an/an/an/an/an/a
University of Arizona
Curated by ChEMBL
Assay Description
Displacement of [125I]CCK-8(SO3) from human CCK1 receptor expressed in human HEK293 cells
Bioorg Med Chem Lett 20: 4080-4 (2010)
Article DOI: 10.1016/j.bmcl.2010.05.078
BindingDB Entry DOI: 10.7270/Q2D79CCN
Cholecystokinin receptor
(Homo sapiens (Human))
BDBM50321607
((3S,6S,9S,12S,15R,18S,21S,27R,30S)-18-((1H-imidazo...)
Show SMILES CCCC[C@H](NC(=O)[C@H](Cc1c[nH]c2ccccc12)NC(=O)[C@H](CCCNC(N)=N)NC(=O)[C@@H](Cc1ccc2ccccc2c1)NC(=O)[C@H](Cc1cnc[nH]1)NC(=O)[C@H](Cc1ccccc1)NC(=O)CNC(=O)[C@@H](C)NC(=O)[C@@H](N)Cc1ccc(O)cc1)C(=O)N[C@@H](CC(O)=O)C(=O)N[C@@H](Cc1ccccc1)C(N)=O |r|
Show InChI InChI=1S/C78H94N18O14/c1-3-4-23-58(71(104)96-65(40-67(99)100)77(110)92-60(68(80)101)35-46-16-7-5-8-17-46)90-75(108)63(38-52-41-85-57-24-14-13-22-55(52)57)94-72(105)59(25-15-32-84-78(81)82)91-74(107)62(37-49-26-29-50-20-11-12-21-51(50)33-49)93-76(109)64(39-53-42-83-44-87-53)95-73(106)61(36-47-18-9-6-10-19-47)89-66(98)43-86-69(102)45(2)88-70(103)56(79)34-48-27-30-54(97)31-28-48/h5-14,16-22,24,26-31,33,41-42,44-45,56,58-65,85,97H,3-4,15,23,25,32,34-40,43,79H2,1-2H3,(H2,80,101)(H,83,87)(H,86,102)(H,88,103)(H,89,98)(H,90,108)(H,91,107)(H,92,110)(H,93,109)(H,94,105)(H,95,106)(H,96,104)(H,99,100)(H4,81,82,84)/t45-,56+,58+,59+,60+,61+,62-,63+,64+,65+/m1/s1
Reactome pathway
9n/an/an/an/an/an/an/an/a
University of Arizona
Curated by ChEMBL
Assay Description
Displacement of [125I]CCK-8(SO3) from human CCK1 receptor expressed in human HEK293 cells
Bioorg Med Chem Lett 20: 4080-4 (2010)
Article DOI: 10.1016/j.bmcl.2010.05.078
BindingDB Entry DOI: 10.7270/Q2D79CCN
Cholecystokinin receptor
(Homo sapiens (Human))
BDBM50321607
((3S,6S,9S,12S,15R,18S,21S,27R,30S)-18-((1H-imidazo...)
Show SMILES CCCC[C@H](NC(=O)[C@H](Cc1c[nH]c2ccccc12)NC(=O)[C@H](CCCNC(N)=N)NC(=O)[C@@H](Cc1ccc2ccccc2c1)NC(=O)[C@H](Cc1cnc[nH]1)NC(=O)[C@H](Cc1ccccc1)NC(=O)CNC(=O)[C@@H](C)NC(=O)[C@@H](N)Cc1ccc(O)cc1)C(=O)N[C@@H](CC(O)=O)C(=O)N[C@@H](Cc1ccccc1)C(N)=O |r|
Show InChI InChI=1S/C78H94N18O14/c1-3-4-23-58(71(104)96-65(40-67(99)100)77(110)92-60(68(80)101)35-46-16-7-5-8-17-46)90-75(108)63(38-52-41-85-57-24-14-13-22-55(52)57)94-72(105)59(25-15-32-84-78(81)82)91-74(107)62(37-49-26-29-50-20-11-12-21-51(50)33-49)93-76(109)64(39-53-42-83-44-87-53)95-73(106)61(36-47-18-9-6-10-19-47)89-66(98)43-86-69(102)45(2)88-70(103)56(79)34-48-27-30-54(97)31-28-48/h5-14,16-22,24,26-31,33,41-42,44-45,56,58-65,85,97H,3-4,15,23,25,32,34-40,43,79H2,1-2H3,(H2,80,101)(H,83,87)(H,86,102)(H,88,103)(H,89,98)(H,90,108)(H,91,107)(H,92,110)(H,93,109)(H,94,105)(H,95,106)(H,96,104)(H,99,100)(H4,81,82,84)/t45-,56+,58+,59+,60+,61+,62-,63+,64+,65+/m1/s1
Reactome pathway
120n/an/an/an/an/an/an/an/a
University of Arizona
Curated by ChEMBL
Assay Description
Displacement of [125I]CCK-8(SO3) from human CCK2 receptor expressed in human HEK293 cells
Bioorg Med Chem Lett 20: 4080-4 (2010)
Article DOI: 10.1016/j.bmcl.2010.05.078
BindingDB Entry DOI: 10.7270/Q2D79CCN
Cholecystokinin receptor
(Homo sapiens (Human))
BDBM50321607
((3S,6S,9S,12S,15R,18S,21S,27R,30S)-18-((1H-imidazo...)
Show SMILES CCCC[C@H](NC(=O)[C@H](Cc1c[nH]c2ccccc12)NC(=O)[C@H](CCCNC(N)=N)NC(=O)[C@@H](Cc1ccc2ccccc2c1)NC(=O)[C@H](Cc1cnc[nH]1)NC(=O)[C@H](Cc1ccccc1)NC(=O)CNC(=O)[C@@H](C)NC(=O)[C@@H](N)Cc1ccc(O)cc1)C(=O)N[C@@H](CC(O)=O)C(=O)N[C@@H](Cc1ccccc1)C(N)=O |r|
Show InChI InChI=1S/C78H94N18O14/c1-3-4-23-58(71(104)96-65(40-67(99)100)77(110)92-60(68(80)101)35-46-16-7-5-8-17-46)90-75(108)63(38-52-41-85-57-24-14-13-22-55(52)57)94-72(105)59(25-15-32-84-78(81)82)91-74(107)62(37-49-26-29-50-20-11-12-21-51(50)33-49)93-76(109)64(39-53-42-83-44-87-53)95-73(106)61(36-47-18-9-6-10-19-47)89-66(98)43-86-69(102)45(2)88-70(103)56(79)34-48-27-30-54(97)31-28-48/h5-14,16-22,24,26-31,33,41-42,44-45,56,58-65,85,97H,3-4,15,23,25,32,34-40,43,79H2,1-2H3,(H2,80,101)(H,83,87)(H,86,102)(H,88,103)(H,89,98)(H,90,108)(H,91,107)(H,92,110)(H,93,109)(H,94,105)(H,95,106)(H,96,104)(H,99,100)(H4,81,82,84)/t45-,56+,58+,59+,60+,61+,62-,63+,64+,65+/m1/s1
Reactome pathway
120n/an/an/an/an/an/an/an/a
University of Arizona
Curated by ChEMBL
Assay Description
Displacement of [125I]CCK-8(SO3) from human CCK2 receptor expressed in human HEK293 cells
Bioorg Med Chem Lett 20: 4080-4 (2010)
Article DOI: 10.1016/j.bmcl.2010.05.078
BindingDB Entry DOI: 10.7270/Q2D79CCN
Delta-type opioid receptor
(MOUSE)
BDBM50321607
((3S,6S,9S,12S,15R,18S,21S,27R,30S)-18-((1H-imidazo...)
Show SMILES CCCC[C@H](NC(=O)[C@H](Cc1c[nH]c2ccccc12)NC(=O)[C@H](CCCNC(N)=N)NC(=O)[C@@H](Cc1ccc2ccccc2c1)NC(=O)[C@H](Cc1cnc[nH]1)NC(=O)[C@H](Cc1ccccc1)NC(=O)CNC(=O)[C@@H](C)NC(=O)[C@@H](N)Cc1ccc(O)cc1)C(=O)N[C@@H](CC(O)=O)C(=O)N[C@@H](Cc1ccccc1)C(N)=O |r|
Show InChI InChI=1S/C78H94N18O14/c1-3-4-23-58(71(104)96-65(40-67(99)100)77(110)92-60(68(80)101)35-46-16-7-5-8-17-46)90-75(108)63(38-52-41-85-57-24-14-13-22-55(52)57)94-72(105)59(25-15-32-84-78(81)82)91-74(107)62(37-49-26-29-50-20-11-12-21-51(50)33-49)93-76(109)64(39-53-42-83-44-87-53)95-73(106)61(36-47-18-9-6-10-19-47)89-66(98)43-86-69(102)45(2)88-70(103)56(79)34-48-27-30-54(97)31-28-48/h5-14,16-22,24,26-31,33,41-42,44-45,56,58-65,85,97H,3-4,15,23,25,32,34-40,43,79H2,1-2H3,(H2,80,101)(H,83,87)(H,86,102)(H,88,103)(H,89,98)(H,90,108)(H,91,107)(H,92,110)(H,93,109)(H,94,105)(H,95,106)(H,96,104)(H,99,100)(H4,81,82,84)/t45-,56+,58+,59+,60+,61+,62-,63+,64+,65+/m1/s1
Reactome pathway
n/an/a 60n/an/an/an/an/an/a
University of Arizona
Curated by ChEMBL
Assay Description
Agonist activity at delta opioid receptor in mouse vas deferens assessed as inhibition of electrically-stimulated muscle contraction
Bioorg Med Chem Lett 20: 4080-4 (2010)
Article DOI: 10.1016/j.bmcl.2010.05.078
BindingDB Entry DOI: 10.7270/Q2D79CCN
Mu-type opioid receptor
(GUINEA PIG)
BDBM50321607
((3S,6S,9S,12S,15R,18S,21S,27R,30S)-18-((1H-imidazo...)
Show SMILES CCCC[C@H](NC(=O)[C@H](Cc1c[nH]c2ccccc12)NC(=O)[C@H](CCCNC(N)=N)NC(=O)[C@@H](Cc1ccc2ccccc2c1)NC(=O)[C@H](Cc1cnc[nH]1)NC(=O)[C@H](Cc1ccccc1)NC(=O)CNC(=O)[C@@H](C)NC(=O)[C@@H](N)Cc1ccc(O)cc1)C(=O)N[C@@H](CC(O)=O)C(=O)N[C@@H](Cc1ccccc1)C(N)=O |r|
Show InChI InChI=1S/C78H94N18O14/c1-3-4-23-58(71(104)96-65(40-67(99)100)77(110)92-60(68(80)101)35-46-16-7-5-8-17-46)90-75(108)63(38-52-41-85-57-24-14-13-22-55(52)57)94-72(105)59(25-15-32-84-78(81)82)91-74(107)62(37-49-26-29-50-20-11-12-21-51(50)33-49)93-76(109)64(39-53-42-83-44-87-53)95-73(106)61(36-47-18-9-6-10-19-47)89-66(98)43-86-69(102)45(2)88-70(103)56(79)34-48-27-30-54(97)31-28-48/h5-14,16-22,24,26-31,33,41-42,44-45,56,58-65,85,97H,3-4,15,23,25,32,34-40,43,79H2,1-2H3,(H2,80,101)(H,83,87)(H,86,102)(H,88,103)(H,89,98)(H,90,108)(H,91,107)(H,92,110)(H,93,109)(H,94,105)(H,95,106)(H,96,104)(H,99,100)(H4,81,82,84)/t45-,56+,58+,59+,60+,61+,62-,63+,64+,65+/m1/s1
n/an/a 200n/an/an/an/an/an/a
University of Arizona
Curated by ChEMBL
Assay Description
Agonist activity at mu opioid receptor in guinea pig ileum assessed as inhibition of electrically-stimulated muscle contraction
Bioorg Med Chem Lett 20: 4080-4 (2010)
Article DOI: 10.1016/j.bmcl.2010.05.078
BindingDB Entry DOI: 10.7270/Q2D79CCN
Delta-type opioid receptor
(Homo sapiens (Human))
BDBM50321607
((3S,6S,9S,12S,15R,18S,21S,27R,30S)-18-((1H-imidazo...)
Show SMILES CCCC[C@H](NC(=O)[C@H](Cc1c[nH]c2ccccc12)NC(=O)[C@H](CCCNC(N)=N)NC(=O)[C@@H](Cc1ccc2ccccc2c1)NC(=O)[C@H](Cc1cnc[nH]1)NC(=O)[C@H](Cc1ccccc1)NC(=O)CNC(=O)[C@@H](C)NC(=O)[C@@H](N)Cc1ccc(O)cc1)C(=O)N[C@@H](CC(O)=O)C(=O)N[C@@H](Cc1ccccc1)C(N)=O |r|
Show InChI InChI=1S/C78H94N18O14/c1-3-4-23-58(71(104)96-65(40-67(99)100)77(110)92-60(68(80)101)35-46-16-7-5-8-17-46)90-75(108)63(38-52-41-85-57-24-14-13-22-55(52)57)94-72(105)59(25-15-32-84-78(81)82)91-74(107)62(37-49-26-29-50-20-11-12-21-51(50)33-49)93-76(109)64(39-53-42-83-44-87-53)95-73(106)61(36-47-18-9-6-10-19-47)89-66(98)43-86-69(102)45(2)88-70(103)56(79)34-48-27-30-54(97)31-28-48/h5-14,16-22,24,26-31,33,41-42,44-45,56,58-65,85,97H,3-4,15,23,25,32,34-40,43,79H2,1-2H3,(H2,80,101)(H,83,87)(H,86,102)(H,88,103)(H,89,98)(H,90,108)(H,91,107)(H,92,110)(H,93,109)(H,94,105)(H,95,106)(H,96,104)(H,99,100)(H4,81,82,84)/t45-,56+,58+,59+,60+,61+,62-,63+,64+,65+/m1/s1
Reactome pathway
n/an/a 6.30n/an/an/an/an/an/a
University of Arizona
Curated by ChEMBL
Assay Description
Displacement of [3H]DPDPE from human delta opioid receptor expressed in mouse HN9.10 cells
Bioorg Med Chem Lett 20: 4080-4 (2010)
Article DOI: 10.1016/j.bmcl.2010.05.078
BindingDB Entry DOI: 10.7270/Q2D79CCN
Melanocortin receptor 4
(Homo sapiens (Human))
BDBM50321607
((3S,6S,9S,12S,15R,18S,21S,27R,30S)-18-((1H-imidazo...)
Show SMILES CCCC[C@H](NC(=O)[C@H](Cc1c[nH]c2ccccc12)NC(=O)[C@H](CCCNC(N)=N)NC(=O)[C@@H](Cc1ccc2ccccc2c1)NC(=O)[C@H](Cc1cnc[nH]1)NC(=O)[C@H](Cc1ccccc1)NC(=O)CNC(=O)[C@@H](C)NC(=O)[C@@H](N)Cc1ccc(O)cc1)C(=O)N[C@@H](CC(O)=O)C(=O)N[C@@H](Cc1ccccc1)C(N)=O |r|
Show InChI InChI=1S/C78H94N18O14/c1-3-4-23-58(71(104)96-65(40-67(99)100)77(110)92-60(68(80)101)35-46-16-7-5-8-17-46)90-75(108)63(38-52-41-85-57-24-14-13-22-55(52)57)94-72(105)59(25-15-32-84-78(81)82)91-74(107)62(37-49-26-29-50-20-11-12-21-51(50)33-49)93-76(109)64(39-53-42-83-44-87-53)95-73(106)61(36-47-18-9-6-10-19-47)89-66(98)43-86-69(102)45(2)88-70(103)56(79)34-48-27-30-54(97)31-28-48/h5-14,16-22,24,26-31,33,41-42,44-45,56,58-65,85,97H,3-4,15,23,25,32,34-40,43,79H2,1-2H3,(H2,80,101)(H,83,87)(H,86,102)(H,88,103)(H,89,98)(H,90,108)(H,91,107)(H,92,110)(H,93,109)(H,94,105)(H,95,106)(H,96,104)(H,99,100)(H4,81,82,84)/t45-,56+,58+,59+,60+,61+,62-,63+,64+,65+/m1/s1
n/an/a 251n/an/an/an/an/an/a
University of Arizona
Curated by ChEMBL
Assay Description
Displacement of Eu-NDP-alphaMSH from human MC4 receptor expressed in human HEK293 cells
Bioorg Med Chem Lett 20: 4080-4 (2010)
Article DOI: 10.1016/j.bmcl.2010.05.078
BindingDB Entry DOI: 10.7270/Q2D79CCN
Mu-type opioid receptor
(Rattus norvegicus (rat))
BDBM50321607
((3S,6S,9S,12S,15R,18S,21S,27R,30S)-18-((1H-imidazo...)
Show SMILES CCCC[C@H](NC(=O)[C@H](Cc1c[nH]c2ccccc12)NC(=O)[C@H](CCCNC(N)=N)NC(=O)[C@@H](Cc1ccc2ccccc2c1)NC(=O)[C@H](Cc1cnc[nH]1)NC(=O)[C@H](Cc1ccccc1)NC(=O)CNC(=O)[C@@H](C)NC(=O)[C@@H](N)Cc1ccc(O)cc1)C(=O)N[C@@H](CC(O)=O)C(=O)N[C@@H](Cc1ccccc1)C(N)=O |r|
Show InChI InChI=1S/C78H94N18O14/c1-3-4-23-58(71(104)96-65(40-67(99)100)77(110)92-60(68(80)101)35-46-16-7-5-8-17-46)90-75(108)63(38-52-41-85-57-24-14-13-22-55(52)57)94-72(105)59(25-15-32-84-78(81)82)91-74(107)62(37-49-26-29-50-20-11-12-21-51(50)33-49)93-76(109)64(39-53-42-83-44-87-53)95-73(106)61(36-47-18-9-6-10-19-47)89-66(98)43-86-69(102)45(2)88-70(103)56(79)34-48-27-30-54(97)31-28-48/h5-14,16-22,24,26-31,33,41-42,44-45,56,58-65,85,97H,3-4,15,23,25,32,34-40,43,79H2,1-2H3,(H2,80,101)(H,83,87)(H,86,102)(H,88,103)(H,89,98)(H,90,108)(H,91,107)(H,92,110)(H,93,109)(H,94,105)(H,95,106)(H,96,104)(H,99,100)(H4,81,82,84)/t45-,56+,58+,59+,60+,61+,62-,63+,64+,65+/m1/s1
Reactome pathway
n/an/a 1.30n/an/an/an/an/an/a
University of Arizona
Curated by ChEMBL
Assay Description
Displacement of [3H]DAMGO from rat mu opioid receptor expressed in mouse HN9.10 cells
Bioorg Med Chem Lett 20: 4080-4 (2010)
Article DOI: 10.1016/j.bmcl.2010.05.078
BindingDB Entry DOI: 10.7270/Q2D79CCN
Melanocortin receptor 4
(Homo sapiens (Human))
BDBM50321607
((3S,6S,9S,12S,15R,18S,21S,27R,30S)-18-((1H-imidazo...)
Show SMILES CCCC[C@H](NC(=O)[C@H](Cc1c[nH]c2ccccc12)NC(=O)[C@H](CCCNC(N)=N)NC(=O)[C@@H](Cc1ccc2ccccc2c1)NC(=O)[C@H](Cc1cnc[nH]1)NC(=O)[C@H](Cc1ccccc1)NC(=O)CNC(=O)[C@@H](C)NC(=O)[C@@H](N)Cc1ccc(O)cc1)C(=O)N[C@@H](CC(O)=O)C(=O)N[C@@H](Cc1ccccc1)C(N)=O |r|
Show InChI InChI=1S/C78H94N18O14/c1-3-4-23-58(71(104)96-65(40-67(99)100)77(110)92-60(68(80)101)35-46-16-7-5-8-17-46)90-75(108)63(38-52-41-85-57-24-14-13-22-55(52)57)94-72(105)59(25-15-32-84-78(81)82)91-74(107)62(37-49-26-29-50-20-11-12-21-51(50)33-49)93-76(109)64(39-53-42-83-44-87-53)95-73(106)61(36-47-18-9-6-10-19-47)89-66(98)43-86-69(102)45(2)88-70(103)56(79)34-48-27-30-54(97)31-28-48/h5-14,16-22,24,26-31,33,41-42,44-45,56,58-65,85,97H,3-4,15,23,25,32,34-40,43,79H2,1-2H3,(H2,80,101)(H,83,87)(H,86,102)(H,88,103)(H,89,98)(H,90,108)(H,91,107)(H,92,110)(H,93,109)(H,94,105)(H,95,106)(H,96,104)(H,99,100)(H4,81,82,84)/t45-,56+,58+,59+,60+,61+,62-,63+,64+,65+/m1/s1
n/an/a 251n/an/an/an/an/an/a
University of Arizona
Curated by ChEMBL
Assay Description
Displacement of Eu-NDP-alphaMSH from human MC4 receptor expressed in human HEK293 cells
Bioorg Med Chem Lett 20: 4080-4 (2010)
Article DOI: 10.1016/j.bmcl.2010.05.078
BindingDB Entry DOI: 10.7270/Q2D79CCN