null
SMILES: NC(=O)c1cc([nH]c1-c1ccc2sccc2c1)-c1ccnc(N)n1
InChI Key: InChIKey=WPDINEQTRUOZHZ-UHFFFAOYSA-N
Activity Spreadsheet -- Enzyme Inhibition Constant Data from BindingDB
Found 2 hits for monomerid = 50329421
Trg + Lig
Ki
nM
ΔG°
kcal/mole
IC50
nM
Kd
nM
EC50/IC50
nM
koff
s-1
kon
M-1s-1
pHTemp
°C
Cell division cycle 7-related protein kinase [58-574]/Protein DBF4 homolog A
(Homo sapiens (Human))
BDBM50329421
(5-(2-Amino-pyrimidin-4-yl)-2-benzo[b]thiophen-5-yl...)
Show SMILES NC(=O)c1cc([nH]c1-c1ccc2sccc2c1)-c1ccnc(N)n1
Show InChI InChI=1S/C17H13N5OS/c18-16(23)11-8-13(12-3-5-20-17(19)22-12)21-15(11)10-1-2-14-9(7-10)4-6-24-14/h1-8,21H,(H2,18,23)(H2,19,20,22)
Reactome pathway
US Patent
n/an/a<1.00E+3n/an/an/an/an/an/a
NERVIANO MEDICAL SCIENCES S.R.L.
US Patent
Assay Description
The assay consists of the transfer of radioactivity labeled phosphate moiety by the kinase to an acceptor substrate. The resulting 33P-labeled produc...
US Patent US9670191 (2017)
BindingDB Entry DOI: 10.7270/Q2X63K3K
Cell division cycle 7-related protein kinase
(Homo sapiens (Human))
BDBM50329421
(5-(2-Amino-pyrimidin-4-yl)-2-benzo[b]thiophen-5-yl...)
Show SMILES NC(=O)c1cc([nH]c1-c1ccc2sccc2c1)-c1ccnc(N)n1
Show InChI InChI=1S/C17H13N5OS/c18-16(23)11-8-13(12-3-5-20-17(19)22-12)21-15(11)10-1-2-14-9(7-10)4-6-24-14/h1-8,21H,(H2,18,23)(H2,19,20,22)
Reactome pathway
n/an/a 82n/an/an/an/an/an/a
Nerviano Medical Sciences Srl
Curated by ChEMBL
Assay Description
Inhibition of Cdc7
J Med Chem 53: 7296-315 (2010)
Article DOI: 10.1021/jm100504d
BindingDB Entry DOI: 10.7270/Q24T6JM3